null
SMILES: COc1ccc(\C=C\c2cccnc2)cc1OC
InChI Key: InChIKey=AKUYGGPOBONQMT-AATRIKPKSA-N
Activity Spreadsheet -- Enzyme Inhibition Constant Data from BindingDB
Found 2 hits for monomerid = 50279891
Trg + Lig
Ki
nM
ΔG°
kcal/mole
IC50
nM
Kd
nM
EC50/IC50
nM
koff
s-1
kon
M-1s-1
pHTemp
°C
Tyrosine-protein kinase Lck
(Homo sapiens (Human))
BDBM50279891
(3-(3,4-dimethoxystyryl)pyridine | 3-[(E)-2-(3,4-Di...)
Show SMILES COc1ccc(\C=C\c2cccnc2)cc1OC
Show InChI InChI=1S/C15H15NO2/c1-17-14-8-7-12(10-15(14)18-2)5-6-13-4-3-9-16-11-13/h3-11H,1-2H3/b6-5+
n/an/a 2n/an/an/an/an/an/a
TBA
Curated by ChEMBL
Assay Description
Inhibition of p56 lck
J Nat Prod 55: 1529-1560 (1992)
Article DOI: 10.1021/np50089a001
BindingDB Entry DOI: 10.7270/Q2J966CC
Tyrosine-protein kinase Lck
(Homo sapiens (Human))
BDBM50279891
(3-(3,4-dimethoxystyryl)pyridine | 3-[(E)-2-(3,4-Di...)
Show SMILES COc1ccc(\C=C\c2cccnc2)cc1OC
Show InChI InChI=1S/C15H15NO2/c1-17-14-8-7-12(10-15(14)18-2)5-6-13-4-3-9-16-11-13/h3-11H,1-2H3/b6-5+
n/an/a 1.78E+5n/an/an/an/an/an/a
TBA
Curated by ChEMBL
Assay Description
Inhibition of angiotensin I phosphorylation catalyzed by the protein-tyrosine kinase p56 lck partially purified from bovine thymus.
Bioorg Med Chem Lett 1: 211-214 (1991)
Article DOI: 10.1016/S0960-894X(00)80254-1
BindingDB Entry DOI: 10.7270/Q2H70FP1