null
SMILES: COc1ccc(CC(=O)N2CCN(CC2CN2CC[C@H](O)C2)C(C)=O)cc1
InChI Key: InChIKey=KPROYTOCROSGBH-ZVAWYAOSSA-N
Activity Spreadsheet -- Enzyme Inhibition Constant Data from BindingDB
Found 1 hit for monomerid = 50280146
Trg + Lig
Ki
nM
ΔG°
kcal/mole
IC50
nM
Kd
nM
EC50/IC50
nM
koff
s-1
kon
M-1s-1
pHTemp
°C
Kappa-type opioid receptor
(Homo sapiens (Human))
BDBM50280146
(1-[4-Acetyl-2-((S)-3-hydroxy-pyrrolidin-1-ylmethyl...)
Show SMILES COc1ccc(CC(=O)N2CCN(CC2CN2CC[C@H](O)C2)C(C)=O)cc1
Show InChI InChI=1S/C20H29N3O4/c1-15(24)22-9-10-23(17(13-22)12-21-8-7-18(25)14-21)20(26)11-16-3-5-19(27-2)6-4-16/h3-6,17-18,25H,7-14H2,1-2H3/t17?,18-/m0/s1
Reactome pathway
n/an/a 230n/an/an/an/an/an/a
TBA
Curated by ChEMBL
Assay Description
Agonistic activity at kappa opioid receptor of rabbit vas deferens
Bioorg Med Chem Lett 2: 1275-1278 (1992)
Article DOI: 10.1016/S0960-894X(00)80229-2
BindingDB Entry DOI: 10.7270/Q2125SKN