BDBM50280324 CHEMBL49262::[4,4-Dimethyl-6-oxo-1-[2'-(1H-tetrazol-5-yl)-biphenyl-4-ylmethyl]-piperidin-(2E)-ylidene]-acetic acid ethyl ester
SMILES: CCOC(=O)\C=C1/CC(C)(C)CC(=O)N1Cc1ccc(cc1)-c1ccccc1-c1nnn[nH]1
InChI Key: InChIKey=CGVJXFIUZVKUIC-CPNJWEJPSA-N
Data: 1 IC50  1 Kd
Activity Spreadsheet -- Enzyme Inhibition Constant Data from BindingDB
Found 2 hits for monomerid = 50280324
Trg + Lig
Ki
nM
ΔG°
kcal/mole
IC50
nM
Kd
nM
EC50/IC50
nM
koff
s-1
kon
M-1s-1
pHTemp
°C
Type-1 angiotensin II receptor
(RABBIT)
BDBM50280324
(CHEMBL49262 | [4,4-Dimethyl-6-oxo-1-[2'-(1H-tetraz...)
Show SMILES CCOC(=O)\C=C1/CC(C)(C)CC(=O)N1Cc1ccc(cc1)-c1ccccc1-c1nnn[nH]1
Show InChI InChI=1S/C25H27N5O3/c1-4-33-23(32)13-19-14-25(2,3)15-22(31)30(19)16-17-9-11-18(12-10-17)20-7-5-6-8-21(20)24-26-28-29-27-24/h5-13H,4,14-16H2,1-3H3,(H,26,27,28,29)/b19-13+
n/an/an/a 39.8n/an/an/an/an/a
TBA
Curated by ChEMBL
Assay Description
In vitro binding affinity against Angiotensin II receptor in rabbit aorta rings
Bioorg Med Chem Lett 4: 87-92 (1994)
Article DOI: 10.1016/S0960-894X(01)81127-6
BindingDB Entry DOI: 10.7270/Q2BC40QF
Type-1 angiotensin II receptor
(Bos taurus)
BDBM50280324
(CHEMBL49262 | [4,4-Dimethyl-6-oxo-1-[2'-(1H-tetraz...)
Show SMILES CCOC(=O)\C=C1/CC(C)(C)CC(=O)N1Cc1ccc(cc1)-c1ccccc1-c1nnn[nH]1
Show InChI InChI=1S/C25H27N5O3/c1-4-33-23(32)13-19-14-25(2,3)15-22(31)30(19)16-17-9-11-18(12-10-17)20-7-5-6-8-21(20)24-26-28-29-27-24/h5-13H,4,14-16H2,1-3H3,(H,26,27,28,29)/b19-13+
Reactome pathway
n/an/a 5.80E+3n/an/an/an/an/an/a
TBA
Curated by ChEMBL
Assay Description
Ability of the compound to displace [125I]- labelled [Sar1,Ileu8] from angiotensin II receptor of bovine adrenal cortex membranes
Bioorg Med Chem Lett 2: 1775-1779 (1992)
Article DOI: 10.1016/S0960-894X(00)80474-6
BindingDB Entry DOI: 10.7270/Q2NP24B9