BDBM50280559 1-Aza-bicyclo[2.2.1]heptan-3-one O-ethyl-oxime::CHEMBL352908
SMILES: CCO\N=C1/CN2CCC1C2
InChI Key: InChIKey=LIYNIIYRYCYRCY-CMDGGOBGSA-N
Data: 1 IC50  1 EC50
Activity Spreadsheet -- Enzyme Inhibition Constant Data from BindingDB
Found 2 hits for monomerid = 50280559
Trg + Lig
Ki
nM
ΔG°
kcal/mole
IC50
nM
Kd
nM
EC50/IC50
nM
koff
s-1
kon
M-1s-1
pHTemp
°C
Muscarinic acetylcholine receptor
(RAT)
BDBM50280559
(1-Aza-bicyclo[2.2.1]heptan-3-one O-ethyl-oxime | C...)
Show SMILES CCO\N=C1/CN2CCC1C2 |THB:3:4:10:8.7|
Show InChI InChI=1S/C8H14N2O/c1-2-11-9-8-6-10-4-3-7(8)5-10/h7H,2-6H2,1H3/b9-8+
NCI pathway
Reactome pathway
n/an/a 13n/an/an/an/an/an/a
TBA
Curated by ChEMBL
Assay Description
Compound was evaluated for inhibition of [3H]cis-methyldioxolane binding to label agonist sites (RCMD) in rat neocortex
Bioorg Med Chem Lett 2: 821-826 (1992)
Article DOI: 10.1016/S0960-894X(00)80538-7
BindingDB Entry DOI: 10.7270/Q2PG1RNN
Muscarinic acetylcholine receptor M3
(Homo sapiens (Human))
BDBM50280559
(1-Aza-bicyclo[2.2.1]heptan-3-one O-ethyl-oxime | C...)
Show SMILES CCO\N=C1/CN2CCC1C2 |THB:3:4:10:8.7|
Show InChI InChI=1S/C8H14N2O/c1-2-11-9-8-6-10-4-3-7(8)5-10/h7H,2-6H2,1H3/b9-8+
Reactome pathway
n/an/an/an/a 8.90E+3n/an/an/an/a
TBA
Curated by ChEMBL
Assay Description
Effective concentration for MIPA (muscarinic-stimulated inositol phosphate accumulation) activity in SK-N-SH neuroblastoma cells expressing human mus...
Bioorg Med Chem Lett 2: 821-826 (1992)
Article DOI: 10.1016/S0960-894X(00)80538-7
BindingDB Entry DOI: 10.7270/Q2PG1RNN