BDBM50280626 8-chloro-10-azatetracyclo[10.2.1.02,11.04,9]pentadeca-2,4,6,8,10-pentaen-3-amine::8-chloro-10-azoniatetracyclo[10.2.1.02,11.04,9]pentadeca-2,4,6,8,10-pentaen-3-amine::CHEMBL355740
SMILES: Nc1c2C3CCC(C3)c2nc2c(Cl)cccc12
InChI Key: InChIKey=NNGFBICBXZNRCM-UHFFFAOYSA-N
Data: 4 IC50
Activity Spreadsheet -- Enzyme Inhibition Constant Data from BindingDB
Found 4 hits for monomerid = 50280626
Trg + Lig
Ki
nM
ΔG°
kcal/mole
IC50
nM
Kd
nM
EC50/IC50
nM
koff
s-1
kon
M-1s-1
pHTemp
°C
Butyrylcholinesterase (BChE)
(Equus caballus (Horse))
BDBM50280626
(8-chloro-10-azatetracyclo[10.2.1.02,11.04,9]pentad...)
Show SMILES Nc1c2C3CCC(C3)c2nc2c(Cl)cccc12
Show InChI InChI=1S/C14H13ClN2/c15-10-3-1-2-9-12(16)11-7-4-5-8(6-7)13(11)17-14(9)10/h1-3,7-8H,4-6H2,(H2,16,17)
n/an/a 207n/an/an/an/an/an/a
TBA
Curated by ChEMBL
Assay Description
Inhibition of (BChE) Butyrylcholinesterase of horse serum
Bioorg Med Chem Lett 2: 861-864 (1992)
Article DOI: 10.1016/S0960-894X(00)80545-4
BindingDB Entry DOI: 10.7270/Q29886XS
Acetylcholinesterase
(Homo sapiens (Human))
BDBM50280626
(8-chloro-10-azatetracyclo[10.2.1.02,11.04,9]pentad...)
Show SMILES Nc1c2C3CCC(C3)c2nc2c(Cl)cccc12
Show InChI InChI=1S/C14H13ClN2/c15-10-3-1-2-9-12(16)11-7-4-5-8(6-7)13(11)17-14(9)10/h1-3,7-8H,4-6H2,(H2,16,17)
NCI pathway
Reactome pathway
n/an/a 85n/an/an/an/an/an/a
Universitat de Barcelona
Curated by ChEMBL
Assay Description
In vitro inhibitory activity against human erythrocyte acetylcholinesterase
J Med Chem 47: 4471-82 (2004)
Article DOI: 10.1021/jm049877p
BindingDB Entry DOI: 10.7270/Q26974WJ
Acetylcholinesterase
(Electrophorus electricus (Electric eel))
BDBM50280626
(8-chloro-10-azatetracyclo[10.2.1.02,11.04,9]pentad...)
Show SMILES Nc1c2C3CCC(C3)c2nc2c(Cl)cccc12
Show InChI InChI=1S/C14H13ClN2/c15-10-3-1-2-9-12(16)11-7-4-5-8(6-7)13(11)17-14(9)10/h1-3,7-8H,4-6H2,(H2,16,17)
n/an/a 493n/an/an/an/an/an/a
TBA
Curated by ChEMBL
Assay Description
Inhibition of acetylcholinesterase (AChE) in electric eel (type V-S) by modified radiometric assay
Bioorg Med Chem Lett 2: 861-864 (1992)
Article DOI: 10.1016/S0960-894X(00)80545-4
BindingDB Entry DOI: 10.7270/Q29886XS
Acetylcholinesterase
(Homo sapiens (Human))
BDBM50280626
(8-chloro-10-azatetracyclo[10.2.1.02,11.04,9]pentad...)
Show SMILES Nc1c2C3CCC(C3)c2nc2c(Cl)cccc12
Show InChI InChI=1S/C14H13ClN2/c15-10-3-1-2-9-12(16)11-7-4-5-8(6-7)13(11)17-14(9)10/h1-3,7-8H,4-6H2,(H2,16,17)
NCI pathway
Reactome pathway
n/an/a 84n/an/an/an/an/an/a
TBA
Curated by ChEMBL
Assay Description
Inhibition of acetylcholinesterase (AChE) of human red blood cell (type XIII) by modified radiometric AChE assay
Bioorg Med Chem Lett 2: 861-864 (1992)
Article DOI: 10.1016/S0960-894X(00)80545-4
BindingDB Entry DOI: 10.7270/Q29886XS