BDBM50280656 3-Hydroxy-benzo[4,5]thieno[3,2-b]furan-2-carboxylic acid methyl ester::CHEMBL274561
SMILES: COC(=O)c1oc2c3ccccc3sc2c1O
InChI Key: InChIKey=XXOVGJPQSVQYTQ-UHFFFAOYSA-N
Data: 1 IC50
Activity Spreadsheet -- Enzyme Inhibition Constant Data from BindingDB
Found 1 hit for monomerid = 50280656
Trg + Lig
Ki
nM
ΔG°
kcal/mole
IC50
nM
Kd
nM
EC50/IC50
nM
koff
s-1
kon
M-1s-1
pHTemp
°C
Thrombin
(Bos taurus (Bovine))
BDBM50280656
(3-Hydroxy-benzo[4,5]thieno[3,2-b]furan-2-carboxyli...)
Show SMILES COC(=O)c1oc2c3ccccc3sc2c1O
Show InChI InChI=1S/C12H8O4S/c1-15-12(14)10-8(13)11-9(16-10)6-4-2-3-5-7(6)17-11/h2-5,13H,1H3
n/an/a>1.00E+4n/an/an/an/an/an/a
TBA
Curated by ChEMBL
Assay Description
In vitro concentration of compound required to inhibit 50% of 6 nM thrombin
Bioorg Med Chem Lett 2: 1025-1028 (1992)
Article DOI: 10.1016/S0960-894X(00)80611-3
BindingDB Entry DOI: 10.7270/Q2X066XV