BDBM50280819 1-{2-[4-(5-Fluoro-1H-indol-3-ylmethyl)-piperidin-1-yl]-ethyl}-1H,3H-perimidin-2-one::CHEMBL57506
SMILES: Fc1ccc2[nH]cc(CC3CCN(CCn4c5cccc6cccc([nH]c4=O)c56)CC3)c2c1
InChI Key: InChIKey=QHPHOWVDZTXSOR-UHFFFAOYSA-N
Data: 4 IC50
Activity Spreadsheet -- Enzyme Inhibition Constant Data from BindingDB
Found 4 hits for monomerid = 50280819
Trg + Lig
Ki
nM
ΔG°
kcal/mole
IC50
nM
Kd
nM
EC50/IC50
nM
koff
s-1
kon
M-1s-1
pHTemp
°C
D(2) dopamine receptor
(Mus musculus (Mouse))
BDBM50280819
(1-{2-[4-(5-Fluoro-1H-indol-3-ylmethyl)-piperidin-1...)
Show SMILES Fc1ccc2[nH]cc(CC3CCN(CCn4c5cccc6cccc([nH]c4=O)c56)CC3)c2c1
Show InChI InChI=1S/C27H27FN4O/c28-21-7-8-23-22(16-21)20(17-29-23)15-18-9-11-31(12-10-18)13-14-32-25-6-2-4-19-3-1-5-24(26(19)25)30-27(32)33/h1-8,16-18,29H,9-15H2,(H,30,33)
n/an/a>100n/an/an/an/an/an/a
TBA
Curated by ChEMBL
Assay Description
Tested for its binding affinity against Dopamine receptor D2; showed no appreciable affinity at concentration specified
Bioorg Med Chem Lett 3: 1913-1918 (1993)
Article DOI: 10.1016/S0960-894X(01)80986-0
BindingDB Entry DOI: 10.7270/Q27944M4
Muscarinic acetylcholine receptor
(Homo sapiens (Human))
BDBM50280819
(1-{2-[4-(5-Fluoro-1H-indol-3-ylmethyl)-piperidin-1...)
Show SMILES Fc1ccc2[nH]cc(CC3CCN(CCn4c5cccc6cccc([nH]c4=O)c56)CC3)c2c1
Show InChI InChI=1S/C27H27FN4O/c28-21-7-8-23-22(16-21)20(17-29-23)15-18-9-11-31(12-10-18)13-14-32-25-6-2-4-19-3-1-5-24(26(19)25)30-27(32)33/h1-8,16-18,29H,9-15H2,(H,30,33)
NCI pathway
Reactome pathway
n/an/a>100n/an/an/an/an/an/a
TBA
Curated by ChEMBL
Assay Description
Tested for its binding affinity against muscarinic receptor; showed no appreciable affinity at concentration specified
Bioorg Med Chem Lett 3: 1913-1918 (1993)
Article DOI: 10.1016/S0960-894X(01)80986-0
BindingDB Entry DOI: 10.7270/Q27944M4
Alpha-1 adrenergic receptor
(Mus musculus (Mouse))
BDBM50280819
(1-{2-[4-(5-Fluoro-1H-indol-3-ylmethyl)-piperidin-1...)
Show SMILES Fc1ccc2[nH]cc(CC3CCN(CCn4c5cccc6cccc([nH]c4=O)c56)CC3)c2c1
Show InChI InChI=1S/C27H27FN4O/c28-21-7-8-23-22(16-21)20(17-29-23)15-18-9-11-31(12-10-18)13-14-32-25-6-2-4-19-3-1-5-24(26(19)25)30-27(32)33/h1-8,16-18,29H,9-15H2,(H,30,33)
n/an/a>100n/an/an/an/an/an/a
TBA
Curated by ChEMBL
Assay Description
Tested for its binding affinity against Alpha-1 adrenergic receptor; showed no appreciable affinity at concentration specified
Bioorg Med Chem Lett 3: 1913-1918 (1993)
Article DOI: 10.1016/S0960-894X(01)80986-0
BindingDB Entry DOI: 10.7270/Q27944M4
Serotonin 1 (5-HT1) receptor
(RAT-Rattus norvegicus (rat)-Rattus norvegicus (Rat...)
BDBM50280819
(1-{2-[4-(5-Fluoro-1H-indol-3-ylmethyl)-piperidin-1...)
Show SMILES Fc1ccc2[nH]cc(CC3CCN(CCn4c5cccc6cccc([nH]c4=O)c56)CC3)c2c1
Show InChI InChI=1S/C27H27FN4O/c28-21-7-8-23-22(16-21)20(17-29-23)15-18-9-11-31(12-10-18)13-14-32-25-6-2-4-19-3-1-5-24(26(19)25)30-27(32)33/h1-8,16-18,29H,9-15H2,(H,30,33)
n/an/a 1.5n/an/an/an/an/an/a
TBA
Curated by ChEMBL
Assay Description
Compound was evaluated for inhibition of 5-HT uptake by measuring its ability to inhibit [3H]paroxetine binding to rat cortical membranes
Bioorg Med Chem Lett 3: 1913-1918 (1993)
Article DOI: 10.1016/S0960-894X(01)80986-0
BindingDB Entry DOI: 10.7270/Q27944M4