BDBM50280822 4-{2-[4-(5-Fluoro-1H-indol-3-ylmethyl)-piperidin-1-yl]-ethyl}-4H-benzo[1,4]thiazin-3-one::CHEMBL294425
SMILES: Fc1ccc2[nH]cc(CC3CCN(CCN4C(=O)CSc5ccccc45)CC3)c2c1
InChI Key: InChIKey=JSPVAYAOSGJUAY-UHFFFAOYSA-N
Data: 4 IC50
Activity Spreadsheet -- Enzyme Inhibition Constant Data from BindingDB
Found 4 hits for monomerid = 50280822
Trg + Lig
Ki
nM
ΔG°
kcal/mole
IC50
nM
Kd
nM
EC50/IC50
nM
koff
s-1
kon
M-1s-1
pHTemp
°C
D(2) dopamine receptor
(Mus musculus (Mouse))
BDBM50280822
(4-{2-[4-(5-Fluoro-1H-indol-3-ylmethyl)-piperidin-1...)
Show SMILES Fc1ccc2[nH]cc(CC3CCN(CCN4C(=O)CSc5ccccc45)CC3)c2c1
Show InChI InChI=1S/C24H26FN3OS/c25-19-5-6-21-20(14-19)18(15-26-21)13-17-7-9-27(10-8-17)11-12-28-22-3-1-2-4-23(22)30-16-24(28)29/h1-6,14-15,17,26H,7-13,16H2
n/an/a>100n/an/an/an/an/an/a
TBA
Curated by ChEMBL
Assay Description
Tested for its binding affinity against Dopamine receptor D2; showed no appreciable affinity at concentration specified
Bioorg Med Chem Lett 3: 1913-1918 (1993)
Article DOI: 10.1016/S0960-894X(01)80986-0
BindingDB Entry DOI: 10.7270/Q27944M4
Muscarinic acetylcholine receptor
(Homo sapiens (Human))
BDBM50280822
(4-{2-[4-(5-Fluoro-1H-indol-3-ylmethyl)-piperidin-1...)
Show SMILES Fc1ccc2[nH]cc(CC3CCN(CCN4C(=O)CSc5ccccc45)CC3)c2c1
Show InChI InChI=1S/C24H26FN3OS/c25-19-5-6-21-20(14-19)18(15-26-21)13-17-7-9-27(10-8-17)11-12-28-22-3-1-2-4-23(22)30-16-24(28)29/h1-6,14-15,17,26H,7-13,16H2
NCI pathway
Reactome pathway
n/an/a>100n/an/an/an/an/an/a
TBA
Curated by ChEMBL
Assay Description
Tested for its binding affinity against muscarinic receptor; showed no appreciable affinity at concentration specified
Bioorg Med Chem Lett 3: 1913-1918 (1993)
Article DOI: 10.1016/S0960-894X(01)80986-0
BindingDB Entry DOI: 10.7270/Q27944M4
Alpha-1 adrenergic receptor
(Mus musculus (Mouse))
BDBM50280822
(4-{2-[4-(5-Fluoro-1H-indol-3-ylmethyl)-piperidin-1...)
Show SMILES Fc1ccc2[nH]cc(CC3CCN(CCN4C(=O)CSc5ccccc45)CC3)c2c1
Show InChI InChI=1S/C24H26FN3OS/c25-19-5-6-21-20(14-19)18(15-26-21)13-17-7-9-27(10-8-17)11-12-28-22-3-1-2-4-23(22)30-16-24(28)29/h1-6,14-15,17,26H,7-13,16H2
n/an/a>100n/an/an/an/an/an/a
TBA
Curated by ChEMBL
Assay Description
Tested for its binding affinity against Alpha-1 adrenergic receptor; showed no appreciable affinity at concentration specified
Bioorg Med Chem Lett 3: 1913-1918 (1993)
Article DOI: 10.1016/S0960-894X(01)80986-0
BindingDB Entry DOI: 10.7270/Q27944M4
Serotonin 1 (5-HT1) receptor
(RAT-Rattus norvegicus (rat)-Rattus norvegicus (Rat...)
BDBM50280822
(4-{2-[4-(5-Fluoro-1H-indol-3-ylmethyl)-piperidin-1...)
Show SMILES Fc1ccc2[nH]cc(CC3CCN(CCN4C(=O)CSc5ccccc45)CC3)c2c1
Show InChI InChI=1S/C24H26FN3OS/c25-19-5-6-21-20(14-19)18(15-26-21)13-17-7-9-27(10-8-17)11-12-28-22-3-1-2-4-23(22)30-16-24(28)29/h1-6,14-15,17,26H,7-13,16H2
n/an/a 1.10n/an/an/an/an/an/a
TBA
Curated by ChEMBL
Assay Description
Compound was evaluated for inhibition of 5-HT uptake by measuring its ability to inhibit [3H]paroxetine binding to rat cortical membranes
Bioorg Med Chem Lett 3: 1913-1918 (1993)
Article DOI: 10.1016/S0960-894X(01)80986-0
BindingDB Entry DOI: 10.7270/Q27944M4