BDBM50280832 2-{2-[4-(5-Fluoro-1H-indol-3-ylmethyl)-piperidin-1-yl]-ethyl}-4,4-dimethyl-3,4-dihydro-2H-isoquinolin-1-one::CHEMBL417785
SMILES: CC1(C)CN(CCN2CCC(Cc3c[nH]c4ccc(F)cc34)CC2)C(=O)c2ccccc12
InChI Key: InChIKey=ICSRAOOGQDHJBO-UHFFFAOYSA-N
Data: 4 IC50
Activity Spreadsheet -- Enzyme Inhibition Constant Data from BindingDB
Found 4 hits for monomerid = 50280832
Trg + Lig
Ki
nM
ΔG°
kcal/mole
IC50
nM
Kd
nM
EC50/IC50
nM
koff
s-1
kon
M-1s-1
pHTemp
°C
D(2) dopamine receptor
(Mus musculus (Mouse))
BDBM50280832
(2-{2-[4-(5-Fluoro-1H-indol-3-ylmethyl)-piperidin-1...)
Show SMILES CC1(C)CN(CCN2CCC(Cc3c[nH]c4ccc(F)cc34)CC2)C(=O)c2ccccc12
Show InChI InChI=1S/C27H32FN3O/c1-27(2)18-31(26(32)22-5-3-4-6-24(22)27)14-13-30-11-9-19(10-12-30)15-20-17-29-25-8-7-21(28)16-23(20)25/h3-8,16-17,19,29H,9-15,18H2,1-2H3
n/an/a>100n/an/an/an/an/an/a
TBA
Curated by ChEMBL
Assay Description
Tested for its binding affinity against Dopamine receptor D2; showed no appreciable affinity at concentration specified
Bioorg Med Chem Lett 3: 1913-1918 (1993)
Article DOI: 10.1016/S0960-894X(01)80986-0
BindingDB Entry DOI: 10.7270/Q27944M4
Alpha-1 adrenergic receptor
(Mus musculus (Mouse))
BDBM50280832
(2-{2-[4-(5-Fluoro-1H-indol-3-ylmethyl)-piperidin-1...)
Show SMILES CC1(C)CN(CCN2CCC(Cc3c[nH]c4ccc(F)cc34)CC2)C(=O)c2ccccc12
Show InChI InChI=1S/C27H32FN3O/c1-27(2)18-31(26(32)22-5-3-4-6-24(22)27)14-13-30-11-9-19(10-12-30)15-20-17-29-25-8-7-21(28)16-23(20)25/h3-8,16-17,19,29H,9-15,18H2,1-2H3
n/an/a>100n/an/an/an/an/an/a
TBA
Curated by ChEMBL
Assay Description
Tested for its binding affinity against Alpha-1 adrenergic receptor; showed no appreciable affinity at concentration specified
Bioorg Med Chem Lett 3: 1913-1918 (1993)
Article DOI: 10.1016/S0960-894X(01)80986-0
BindingDB Entry DOI: 10.7270/Q27944M4
Serotonin 1 (5-HT1) receptor
(RAT-Rattus norvegicus (rat)-Rattus norvegicus (Rat...)
BDBM50280832
(2-{2-[4-(5-Fluoro-1H-indol-3-ylmethyl)-piperidin-1...)
Show SMILES CC1(C)CN(CCN2CCC(Cc3c[nH]c4ccc(F)cc34)CC2)C(=O)c2ccccc12
Show InChI InChI=1S/C27H32FN3O/c1-27(2)18-31(26(32)22-5-3-4-6-24(22)27)14-13-30-11-9-19(10-12-30)15-20-17-29-25-8-7-21(28)16-23(20)25/h3-8,16-17,19,29H,9-15,18H2,1-2H3
n/an/a 3.80n/an/an/an/an/an/a
TBA
Curated by ChEMBL
Assay Description
Compound was evaluated for inhibition of 5-HT uptake by measuring its ability to inhibit [3H]paroxetine binding to rat cortical membranes
Bioorg Med Chem Lett 3: 1913-1918 (1993)
Article DOI: 10.1016/S0960-894X(01)80986-0
BindingDB Entry DOI: 10.7270/Q27944M4
Muscarinic acetylcholine receptor
(Homo sapiens (Human))
BDBM50280832
(2-{2-[4-(5-Fluoro-1H-indol-3-ylmethyl)-piperidin-1...)
Show SMILES CC1(C)CN(CCN2CCC(Cc3c[nH]c4ccc(F)cc34)CC2)C(=O)c2ccccc12
Show InChI InChI=1S/C27H32FN3O/c1-27(2)18-31(26(32)22-5-3-4-6-24(22)27)14-13-30-11-9-19(10-12-30)15-20-17-29-25-8-7-21(28)16-23(20)25/h3-8,16-17,19,29H,9-15,18H2,1-2H3
NCI pathway
Reactome pathway
n/an/a>100n/an/an/an/an/an/a
TBA
Curated by ChEMBL
Assay Description
Tested for its binding affinity against muscarinic receptor; showed no appreciable affinity at concentration specified
Bioorg Med Chem Lett 3: 1913-1918 (1993)
Article DOI: 10.1016/S0960-894X(01)80986-0
BindingDB Entry DOI: 10.7270/Q27944M4