null
SMILES: COc1ccc(cc1Cl)C1CCC(OCCCn2c(C)nc3cnccc23)O1
InChI Key: InChIKey=DZJWQOQLLYRSPY-UHFFFAOYSA-N
Activity Spreadsheet -- Enzyme Inhibition Constant Data from BindingDB
Found 1 hit for monomerid = 50282045
Trg + Lig
Ki
nM
ΔG°
kcal/mole
IC50
nM
Kd
nM
EC50/IC50
nM
koff
s-1
kon
M-1s-1
pHTemp
°C
Platelet-activating factor receptor
(Homo sapiens (Human))
BDBM50282045
(1-{3-[5-(3-Chloro-4-methoxy-phenyl)-tetrahydro-fur...)
Show SMILES COc1ccc(cc1Cl)C1CCC(OCCCn2c(C)nc3cnccc23)O1
Show InChI InChI=1S/C21H24ClN3O3/c1-14-24-17-13-23-9-8-18(17)25(14)10-3-11-27-21-7-6-19(28-21)15-4-5-20(26-2)16(22)12-15/h4-5,8-9,12-13,19,21H,3,6-7,10-11H2,1-2H3
Reactome pathway
n/an/a 3n/an/an/an/an/an/a
TBA
Curated by ChEMBL
Assay Description
Inhibition of [3H]PAF receptor binding to washed human platelet membranes determined in vitro
Bioorg Med Chem Lett 3: 1499-1504 (1993)
Article DOI: 10.1016/S0960-894X(00)80006-2
BindingDB Entry DOI: 10.7270/Q2CC115V