BDBM50282472 CHEMBL169221::Quinazolinone Analog
SMILES: CCCCOC(=O)NS(=O)(=O)c1ccccc1-c1ccc(Cn2c(CCC)nc3ccc(NC(=O)NCC)cc3c2=O)cc1
InChI Key: InChIKey=BRAZUXALZLWNTL-UHFFFAOYSA-N
Data: 2 IC50
Activity Spreadsheet -- Enzyme Inhibition Constant Data from BindingDB
Found 2 hits for monomerid = 50282472
Trg + Lig
Ki
nM
ΔG°
kcal/mole
IC50
nM
Kd
nM
EC50/IC50
nM
koff
s-1
kon
M-1s-1
pHTemp
°C
Angiotensin II AT2
(RAT)
BDBM50282472
(CHEMBL169221 | Quinazolinone Analog)
Show SMILES CCCCOC(=O)NS(=O)(=O)c1ccccc1-c1ccc(Cn2c(CCC)nc3ccc(NC(=O)NCC)cc3c2=O)cc1
Show InChI InChI=1S/C32H37N5O6S/c1-4-7-19-43-32(40)36-44(41,42)28-12-9-8-11-25(28)23-15-13-22(14-16-23)21-37-29(10-5-2)35-27-18-17-24(20-26(27)30(37)38)34-31(39)33-6-3/h8-9,11-18,20H,4-7,10,19,21H2,1-3H3,(H,36,40)(H2,33,34,39)
n/an/a 6.30n/an/an/an/an/an/a
TBA
Curated by ChEMBL
Assay Description
In vitro for binding affinity against angiotensin II receptor type 2 in rat midbrain membrane
Bioorg Med Chem Lett 4: 81-86 (1994)
Article DOI: 10.1016/S0960-894X(01)81126-4
BindingDB Entry DOI: 10.7270/Q2D79BBS
Angiotensin II type 1a (AT-1a) receptor
(RABBIT)
BDBM50282472
(CHEMBL169221 | Quinazolinone Analog)
Show SMILES CCCCOC(=O)NS(=O)(=O)c1ccccc1-c1ccc(Cn2c(CCC)nc3ccc(NC(=O)NCC)cc3c2=O)cc1
Show InChI InChI=1S/C32H37N5O6S/c1-4-7-19-43-32(40)36-44(41,42)28-12-9-8-11-25(28)23-15-13-22(14-16-23)21-37-29(10-5-2)35-27-18-17-24(20-26(27)30(37)38)34-31(39)33-6-3/h8-9,11-18,20H,4-7,10,19,21H2,1-3H3,(H,36,40)(H2,33,34,39)
n/an/a 0.180n/an/an/an/an/an/a
TBA
Curated by ChEMBL
Assay Description
Tested in vitro for binding affinity against Angiotensin II receptor, type 1 in rabbit aortic membrane
Bioorg Med Chem Lett 4: 81-86 (1994)
Article DOI: 10.1016/S0960-894X(01)81126-4
BindingDB Entry DOI: 10.7270/Q2D79BBS