BDBM50282859 (2S,4S)-1-[(S)-2-((S)-2-Mercaptomethyl-3-phenyl-propionylamino)-propionyl]-4-phenylsulfanyl-pyrrolidine-2-carboxylic acid::CHEMBL50625
SMILES: C[C@H](NC(=O)[C@@H](CS)Cc1ccccc1)C(=O)N1C[C@H](C[C@H]1C(O)=O)Sc1ccccc1
InChI Key: InChIKey=ZSHMPLDVQGPUEE-OFCAXSSNSA-N
Data: 2 IC50
Activity Spreadsheet -- Enzyme Inhibition Constant Data from BindingDB
Found 2 hits for monomerid = 50282859
Trg + Lig
Ki
nM
ΔG°
kcal/mole
IC50
nM
Kd
nM
EC50/IC50
nM
koff
s-1
kon
M-1s-1
pHTemp
°C
Angiotensin-converting enzyme
(Oryctolagus cuniculus)
BDBM50282859
((2S,4S)-1-[(S)-2-((S)-2-Mercaptomethyl-3-phenyl-pr...)
Show SMILES C[C@H](NC(=O)[C@@H](CS)Cc1ccccc1)C(=O)N1C[C@H](C[C@H]1C(O)=O)Sc1ccccc1
Show InChI InChI=1S/C24H28N2O4S2/c1-16(25-22(27)18(15-31)12-17-8-4-2-5-9-17)23(28)26-14-20(13-21(26)24(29)30)32-19-10-6-3-7-11-19/h2-11,16,18,20-21,31H,12-15H2,1H3,(H,25,27)(H,29,30)/t16-,18+,20-,21-/m0/s1
n/an/a 8.70n/an/an/an/an/an/a
TBA
Curated by ChEMBL
Assay Description
In vitro inhibition of rabbit lung Angiotensin I converting enzyme (ACE) using Hippuryl-His-Leu as substrate
Bioorg Med Chem Lett 4: 1783-1788 (1994)
Article DOI: 10.1016/S0960-894X(01)80371-1
BindingDB Entry DOI: 10.7270/Q2Z3204W
Neutral Endopeptidase (NEP)
(Rattus norvegicus (Rat))
BDBM50282859
((2S,4S)-1-[(S)-2-((S)-2-Mercaptomethyl-3-phenyl-pr...)
Show SMILES C[C@H](NC(=O)[C@@H](CS)Cc1ccccc1)C(=O)N1C[C@H](C[C@H]1C(O)=O)Sc1ccccc1
Show InChI InChI=1S/C24H28N2O4S2/c1-16(25-22(27)18(15-31)12-17-8-4-2-5-9-17)23(28)26-14-20(13-21(26)24(29)30)32-19-10-6-3-7-11-19/h2-11,16,18,20-21,31H,12-15H2,1H3,(H,25,27)(H,29,30)/t16-,18+,20-,21-/m0/s1
Reactome pathway
n/an/a 1.60n/an/an/an/an/an/a
TBA
Curated by ChEMBL
Assay Description
In vitro inhibition of rat kidney neutral endopeptidase (NEP) by fluorometric assay using Dansyl-Gly-Phe-Arg as substrate
Bioorg Med Chem Lett 4: 1783-1788 (1994)
Article DOI: 10.1016/S0960-894X(01)80371-1
BindingDB Entry DOI: 10.7270/Q2Z3204W