null
SMILES: CCCCc1nc2ccc(NC(=O)N(C)C(C)C)cc2c(=O)n1Cc1ccc(cc1F)-c1ccccc1S(=O)(=O)NC(=O)OCCC(C)C
InChI Key: InChIKey=DDCUEFRQMQCTOM-UHFFFAOYSA-N
Activity Spreadsheet -- Enzyme Inhibition Constant Data from BindingDB
Found 6 hits for monomerid = 50283300
Trg + Lig
Ki
nM
ΔG°
kcal/mole
IC50
nM
Kd
nM
EC50/IC50
nM
koff
s-1
kon
M-1s-1
pHTemp
°C
Type-2 angiotensin II receptor
(RAT)
BDBM50283300
(2-Butyl-3-(3-fluoro-2'-(3-methylbutyloxycarbonylam...)
Show SMILES CCCCc1nc2ccc(NC(=O)N(C)C(C)C)cc2c(=O)n1Cc1ccc(cc1F)-c1ccccc1S(=O)(=O)NC(=O)OCCC(C)C
Show InChI InChI=1S/C36H44FN5O6S/c1-7-8-13-33-39-31-17-16-27(38-35(44)41(6)24(4)5)21-29(31)34(43)42(33)22-26-15-14-25(20-30(26)37)28-11-9-10-12-32(28)49(46,47)40-36(45)48-19-18-23(2)3/h9-12,14-17,20-21,23-24H,7-8,13,18-19,22H2,1-6H3,(H,38,44)(H,40,45)
n/an/a 0.220n/an/an/an/an/an/a
TBA
Curated by ChEMBL
Assay Description
In vivo inhibitory concentration of the compound against AT2 receptor of rat adrenal membrane
Bioorg Med Chem Lett 4: 2337-2342 (1994)
Article DOI: 10.1016/0960-894X(94)85036-4
BindingDB Entry DOI: 10.7270/Q2X066Z9
Type-2 angiotensin II receptor
(Homo sapiens (Human))
BDBM50283300
(2-Butyl-3-(3-fluoro-2'-(3-methylbutyloxycarbonylam...)
Show SMILES CCCCc1nc2ccc(NC(=O)N(C)C(C)C)cc2c(=O)n1Cc1ccc(cc1F)-c1ccccc1S(=O)(=O)NC(=O)OCCC(C)C
Show InChI InChI=1S/C36H44FN5O6S/c1-7-8-13-33-39-31-17-16-27(38-35(44)41(6)24(4)5)21-29(31)34(43)42(33)22-26-15-14-25(20-30(26)37)28-11-9-10-12-32(28)49(46,47)40-36(45)48-19-18-23(2)3/h9-12,14-17,20-21,23-24H,7-8,13,18-19,22H2,1-6H3,(H,38,44)(H,40,45)
n/an/a 8n/an/an/an/an/an/a
TBA
Curated by ChEMBL
Assay Description
In vivo inhibitory concentration of the compound against AT2 receptor of human adrenal membrane
Bioorg Med Chem Lett 4: 2337-2342 (1994)
Article DOI: 10.1016/0960-894X(94)85036-4
BindingDB Entry DOI: 10.7270/Q2X066Z9
Type-2 angiotensin II receptor
(RAT)
BDBM50283300
(2-Butyl-3-(3-fluoro-2'-(3-methylbutyloxycarbonylam...)
Show SMILES CCCCc1nc2ccc(NC(=O)N(C)C(C)C)cc2c(=O)n1Cc1ccc(cc1F)-c1ccccc1S(=O)(=O)NC(=O)OCCC(C)C
Show InChI InChI=1S/C36H44FN5O6S/c1-7-8-13-33-39-31-17-16-27(38-35(44)41(6)24(4)5)21-29(31)34(43)42(33)22-26-15-14-25(20-30(26)37)28-11-9-10-12-32(28)49(46,47)40-36(45)48-19-18-23(2)3/h9-12,14-17,20-21,23-24H,7-8,13,18-19,22H2,1-6H3,(H,38,44)(H,40,45)
n/an/a 0.210n/an/an/an/an/an/a
TBA
Curated by ChEMBL
Assay Description
In vivo inhibitory concentration of the compound against Angiotensin II, type 2 of rat midbrain membrane
Bioorg Med Chem Lett 4: 2337-2342 (1994)
Article DOI: 10.1016/0960-894X(94)85036-4
BindingDB Entry DOI: 10.7270/Q2X066Z9
Type-1 angiotensin II receptor
(Homo sapiens (Human))
BDBM50283300
(2-Butyl-3-(3-fluoro-2'-(3-methylbutyloxycarbonylam...)
Show SMILES CCCCc1nc2ccc(NC(=O)N(C)C(C)C)cc2c(=O)n1Cc1ccc(cc1F)-c1ccccc1S(=O)(=O)NC(=O)OCCC(C)C
Show InChI InChI=1S/C36H44FN5O6S/c1-7-8-13-33-39-31-17-16-27(38-35(44)41(6)24(4)5)21-29(31)34(43)42(33)22-26-15-14-25(20-30(26)37)28-11-9-10-12-32(28)49(46,47)40-36(45)48-19-18-23(2)3/h9-12,14-17,20-21,23-24H,7-8,13,18-19,22H2,1-6H3,(H,38,44)(H,40,45)
Reactome pathway
n/an/a 1.90n/an/an/an/an/an/a
TBA
Curated by ChEMBL
Assay Description
In vivo inhibitory concentration of the compound against Angiotensin II receptor, type 1 of human adrenal membrane
Bioorg Med Chem Lett 4: 2337-2342 (1994)
Article DOI: 10.1016/0960-894X(94)85036-4
BindingDB Entry DOI: 10.7270/Q2X066Z9
Type-1 angiotensin II receptor A/B
(RAT)
BDBM50283300
(2-Butyl-3-(3-fluoro-2'-(3-methylbutyloxycarbonylam...)
Show SMILES CCCCc1nc2ccc(NC(=O)N(C)C(C)C)cc2c(=O)n1Cc1ccc(cc1F)-c1ccccc1S(=O)(=O)NC(=O)OCCC(C)C
Show InChI InChI=1S/C36H44FN5O6S/c1-7-8-13-33-39-31-17-16-27(38-35(44)41(6)24(4)5)21-29(31)34(43)42(33)22-26-15-14-25(20-30(26)37)28-11-9-10-12-32(28)49(46,47)40-36(45)48-19-18-23(2)3/h9-12,14-17,20-21,23-24H,7-8,13,18-19,22H2,1-6H3,(H,38,44)(H,40,45)
n/an/a 0.140n/an/an/an/an/an/a
TBA
Curated by ChEMBL
Assay Description
In vivo inhibitory concentration of the compound against Angiotensin II, type 2 of rat midbrain membrane
Bioorg Med Chem Lett 4: 2337-2342 (1994)
Article DOI: 10.1016/0960-894X(94)85036-4
BindingDB Entry DOI: 10.7270/Q2X066Z9
Type-1 angiotensin II receptor
(RABBIT)
BDBM50283300
(2-Butyl-3-(3-fluoro-2'-(3-methylbutyloxycarbonylam...)
Show SMILES CCCCc1nc2ccc(NC(=O)N(C)C(C)C)cc2c(=O)n1Cc1ccc(cc1F)-c1ccccc1S(=O)(=O)NC(=O)OCCC(C)C
Show InChI InChI=1S/C36H44FN5O6S/c1-7-8-13-33-39-31-17-16-27(38-35(44)41(6)24(4)5)21-29(31)34(43)42(33)22-26-15-14-25(20-30(26)37)28-11-9-10-12-32(28)49(46,47)40-36(45)48-19-18-23(2)3/h9-12,14-17,20-21,23-24H,7-8,13,18-19,22H2,1-6H3,(H,38,44)(H,40,45)
n/an/a 0.230n/an/an/an/an/an/a
TBA
Curated by ChEMBL
Assay Description
In vivo inhibitory concentration of the compound against Angiotensin II receptor, type 1 of rabbit aorta membrane
Bioorg Med Chem Lett 4: 2337-2342 (1994)
Article DOI: 10.1016/0960-894X(94)85036-4
BindingDB Entry DOI: 10.7270/Q2X066Z9