BDBM50283596 1-[4-(2-Ethyl-5,6,7,8-tetrahydro-quinolin-4-yloxymethyl)-2'-(2H-tetrazol-5-yl)-biphenyl-2-yl]-ethanone::CHEMBL89143
SMILES: CCc1cc(OCc2ccc(c(c2)C(C)=O)-c2ccccc2-c2nnn[nH]2)c2CCCCc2n1
InChI Key: InChIKey=FJZQPOHKUMBTTB-UHFFFAOYSA-N
Data: 1 IC50
Activity Spreadsheet -- Enzyme Inhibition Constant Data from BindingDB
Found 1 hit for monomerid = 50283596
Trg + Lig
Ki
nM
ΔG°
kcal/mole
IC50
nM
Kd
nM
EC50/IC50
nM
koff
s-1
kon
M-1s-1
pHTemp
°C
Type-1 angiotensin II receptor
(Cavia porcellus)
BDBM50283596
(1-[4-(2-Ethyl-5,6,7,8-tetrahydro-quinolin-4-yloxym...)
Show SMILES CCc1cc(OCc2ccc(c(c2)C(C)=O)-c2ccccc2-c2nnn[nH]2)c2CCCCc2n1
Show InChI InChI=1S/C27H27N5O2/c1-3-19-15-26(23-10-6-7-11-25(23)28-19)34-16-18-12-13-21(24(14-18)17(2)33)20-8-4-5-9-22(20)27-29-31-32-30-27/h4-5,8-9,12-15H,3,6-7,10-11,16H2,1-2H3,(H,29,30,31,32)
n/an/a 6n/an/an/an/an/an/a
TBA
Curated by ChEMBL
Assay Description
Compound was tested for in vitro inhibition of specific binding of [I-125]AII to AT1 receptor in guinea pig adrenal membrane preparation
Bioorg Med Chem Lett 4: 2615-2620 (1994)
Article DOI: 10.1016/S0960-894X(01)80295-X
BindingDB Entry DOI: 10.7270/Q22J6BTX