BDBM50283638 (S)-3-Biphenyl-4-yl-2-{[1-(phosphonomethyl-amino)-cyclopentanecarbonyl]-amino}-propionic acid::CHEMBL329666
SMILES: OC(=O)[C@H](Cc1ccc(cc1)-c1ccccc1)NC(=O)C1(CCCC1)NCP(O)(O)=O
InChI Key: InChIKey=IKNOVKGMOHXNDO-IBGZPJMESA-N
Data: 2 IC50
Activity Spreadsheet -- Enzyme Inhibition Constant Data from BindingDB
Found 2 hits for monomerid = 50283638
Trg + Lig
Ki
nM
ΔG°
kcal/mole
IC50
nM
Kd
nM
EC50/IC50
nM
koff
s-1
kon
M-1s-1
pHTemp
°C
ACEI-ACE2
(Homo sapiens (Human))
BDBM50283638
((S)-3-Biphenyl-4-yl-2-{[1-(phosphonomethyl-amino)-...)
Show SMILES OC(=O)[C@H](Cc1ccc(cc1)-c1ccccc1)NC(=O)C1(CCCC1)NCP(O)(O)=O
Show InChI InChI=1S/C22H27N2O6P/c25-20(26)19(14-16-8-10-18(11-9-16)17-6-2-1-3-7-17)24-21(27)22(12-4-5-13-22)23-15-31(28,29)30/h1-3,6-11,19,23H,4-5,12-15H2,(H,24,27)(H,25,26)(H2,28,29,30)/t19-/m0/s1
NCI pathway
Reactome pathway
n/an/a>1.00E+3n/an/an/an/an/an/a
TBA
Curated by ChEMBL
Assay Description
In vitro inhibitory concentration against angiotensin-converting enzyme
Bioorg Med Chem Lett 4: 2715-2720 (1994)
Article DOI: 10.1016/S0960-894X(01)80703-4
BindingDB Entry DOI: 10.7270/Q2SB467B
Neprilysin
(Homo sapiens (Human))
BDBM50283638
((S)-3-Biphenyl-4-yl-2-{[1-(phosphonomethyl-amino)-...)
Show SMILES OC(=O)[C@H](Cc1ccc(cc1)-c1ccccc1)NC(=O)C1(CCCC1)NCP(O)(O)=O
Show InChI InChI=1S/C22H27N2O6P/c25-20(26)19(14-16-8-10-18(11-9-16)17-6-2-1-3-7-17)24-21(27)22(12-4-5-13-22)23-15-31(28,29)30/h1-3,6-11,19,23H,4-5,12-15H2,(H,24,27)(H,25,26)(H2,28,29,30)/t19-/m0/s1
n/an/a>1.00E+3n/an/an/an/an/an/a
TBA
Curated by ChEMBL
Assay Description
In vitro inhibitory concentration against neutral endopeptidase
Bioorg Med Chem Lett 4: 2715-2720 (1994)
Article DOI: 10.1016/S0960-894X(01)80703-4
BindingDB Entry DOI: 10.7270/Q2SB467B