BDBM50283766 CHEMBL313868::N-(3-{3-Butyl-4-[3-fluoro-2'-(2-fluoro-benzoylsulfamoyl)-5'-propyl-biphenyl-4-ylmethyl]-5-oxo-4,5-dihydro-[1,2,4]triazol-1-yl}-4-chloro-phenyl)-acetamide
SMILES: CCCCc1nn(-c2cc(NC(C)=O)ccc2Cl)c(=O)n1Cc1ccc(cc1F)-c1cc(CCC)ccc1S(=O)(=O)NC(=O)c1ccccc1F
InChI Key: InChIKey=JRSWIJZNNYKJTH-UHFFFAOYSA-N
Data: 4 IC50
Activity Spreadsheet -- Enzyme Inhibition Constant Data from BindingDB
Found 4 hits for monomerid = 50283766
Trg + Lig
Ki
nM
ΔG°
kcal/mole
IC50
nM
Kd
nM
EC50/IC50
nM
koff
s-1
kon
M-1s-1
pHTemp
°C
Angiotensin II AT2
(RAT)
BDBM50283766
(CHEMBL313868 | N-(3-{3-Butyl-4-[3-fluoro-2'-(2-flu...)
Show SMILES CCCCc1nn(-c2cc(NC(C)=O)ccc2Cl)c(=O)n1Cc1ccc(cc1F)-c1cc(CCC)ccc1S(=O)(=O)NC(=O)c1ccccc1F
Show InChI InChI=1S/C37H36ClF2N5O5S/c1-4-6-12-35-42-45(33-21-27(41-23(3)46)16-17-30(33)38)37(48)44(35)22-26-15-14-25(20-32(26)40)29-19-24(9-5-2)13-18-34(29)51(49,50)43-36(47)28-10-7-8-11-31(28)39/h7-8,10-11,13-21H,4-6,9,12,22H2,1-3H3,(H,41,46)(H,43,47)
n/an/a 0.150n/an/an/an/an/an/a
TBA
Curated by ChEMBL
Assay Description
In vitro ability of the compound to inhibit the binding of radioligand 125I[Sar1,IIe8]AII to AT2 receptor from rat midbrain
Bioorg Med Chem Lett 4: 2787-2792 (1994)
Article DOI: 10.1016/S0960-894X(01)80595-3
BindingDB Entry DOI: 10.7270/Q2WS8T68
Angiotensin II receptor
(Homo sapiens (Human))
BDBM50283766
(CHEMBL313868 | N-(3-{3-Butyl-4-[3-fluoro-2'-(2-flu...)
Show SMILES CCCCc1nn(-c2cc(NC(C)=O)ccc2Cl)c(=O)n1Cc1ccc(cc1F)-c1cc(CCC)ccc1S(=O)(=O)NC(=O)c1ccccc1F
Show InChI InChI=1S/C37H36ClF2N5O5S/c1-4-6-12-35-42-45(33-21-27(41-23(3)46)16-17-30(33)38)37(48)44(35)22-26-15-14-25(20-32(26)40)29-19-24(9-5-2)13-18-34(29)51(49,50)43-36(47)28-10-7-8-11-31(28)39/h7-8,10-11,13-21H,4-6,9,12,22H2,1-3H3,(H,41,46)(H,43,47)
n/an/a 2.40n/an/an/an/an/an/a
TBA
Curated by ChEMBL
Assay Description
In vitro inhibitory concentration of the compound against AT2 receptor from human adrenal tissues.
Bioorg Med Chem Lett 4: 2787-2792 (1994)
Article DOI: 10.1016/S0960-894X(01)80595-3
BindingDB Entry DOI: 10.7270/Q2WS8T68
Angiotensin II receptor
(Homo sapiens (Human))
BDBM50283766
(CHEMBL313868 | N-(3-{3-Butyl-4-[3-fluoro-2'-(2-flu...)
Show SMILES CCCCc1nn(-c2cc(NC(C)=O)ccc2Cl)c(=O)n1Cc1ccc(cc1F)-c1cc(CCC)ccc1S(=O)(=O)NC(=O)c1ccccc1F
Show InChI InChI=1S/C37H36ClF2N5O5S/c1-4-6-12-35-42-45(33-21-27(41-23(3)46)16-17-30(33)38)37(48)44(35)22-26-15-14-25(20-32(26)40)29-19-24(9-5-2)13-18-34(29)51(49,50)43-36(47)28-10-7-8-11-31(28)39/h7-8,10-11,13-21H,4-6,9,12,22H2,1-3H3,(H,41,46)(H,43,47)
Reactome pathway
n/an/a 5.90n/an/an/an/an/an/a
TBA
Curated by ChEMBL
Assay Description
In vitro inhibitory concentration of the compound against AT1 receptor from human adrenal tissues.
Bioorg Med Chem Lett 4: 2787-2792 (1994)
Article DOI: 10.1016/S0960-894X(01)80595-3
BindingDB Entry DOI: 10.7270/Q2WS8T68
Angiotensin II type 1a (AT-1a) receptor
(RABBIT)
BDBM50283766
(CHEMBL313868 | N-(3-{3-Butyl-4-[3-fluoro-2'-(2-flu...)
Show SMILES CCCCc1nn(-c2cc(NC(C)=O)ccc2Cl)c(=O)n1Cc1ccc(cc1F)-c1cc(CCC)ccc1S(=O)(=O)NC(=O)c1ccccc1F
Show InChI InChI=1S/C37H36ClF2N5O5S/c1-4-6-12-35-42-45(33-21-27(41-23(3)46)16-17-30(33)38)37(48)44(35)22-26-15-14-25(20-32(26)40)29-19-24(9-5-2)13-18-34(29)51(49,50)43-36(47)28-10-7-8-11-31(28)39/h7-8,10-11,13-21H,4-6,9,12,22H2,1-3H3,(H,41,46)(H,43,47)
n/an/a 0.620n/an/an/an/an/an/a
TBA
Curated by ChEMBL
Assay Description
In vitro ability of the compound to inhibit the binding of radioligand 125I[Sar1,IIe8]AII to AT1 receptor from rabbit aorta
Bioorg Med Chem Lett 4: 2787-2792 (1994)
Article DOI: 10.1016/S0960-894X(01)80595-3
BindingDB Entry DOI: 10.7270/Q2WS8T68