BDBM50283845 2-[(3R,5S,7R)-2-Oxo-7-phenyl-5-o-tolyl-3-(3-m-tolyl-ureido)-azepan-1-yl]-N-o-tolyl-acetamide::CHEMBL317615
SMILES: Cc1cccc(NC(=O)N[C@@H]2C[C@@H](C[C@@H](N(CC(=O)Nc3ccccc3C)C2=O)c2ccccc2)c2ccccc2C)c1
InChI Key: InChIKey=KGFIYGFYTIJLRJ-XEUSQTKLSA-N
Data: 2 IC50
Activity Spreadsheet -- Enzyme Inhibition Constant Data from BindingDB
Found 2 hits for monomerid = 50283845
Trg + Lig
Ki
nM
ΔG°
kcal/mole
IC50
nM
Kd
nM
EC50/IC50
nM
koff
s-1
kon
M-1s-1
pHTemp
°C
Cholecystokinin receptor
(Homo sapiens (Human))
BDBM50283845
(2-[(3R,5S,7R)-2-Oxo-7-phenyl-5-o-tolyl-3-(3-m-toly...)
Show SMILES Cc1cccc(NC(=O)N[C@@H]2C[C@@H](C[C@@H](N(CC(=O)Nc3ccccc3C)C2=O)c2ccccc2)c2ccccc2C)c1
Show InChI InChI=1S/C36H38N4O3/c1-24-12-11-17-29(20-24)37-36(43)39-32-21-28(30-18-9-7-13-25(30)2)22-33(27-15-5-4-6-16-27)40(35(32)42)23-34(41)38-31-19-10-8-14-26(31)3/h4-20,28,32-33H,21-23H2,1-3H3,(H,38,41)(H2,37,39,43)/t28-,32+,33+/m0/s1
Reactome pathway
n/an/a 71n/an/an/an/an/an/a
TBA
Curated by ChEMBL
Assay Description
Inhibitory activity against cholecystokinin-B (CCK-B) receptor in cortex of male hartley guinea pig.
Bioorg Med Chem Lett 4: 2877-2882 (1994)
Article DOI: 10.1016/S0960-894X(01)80832-5
BindingDB Entry DOI: 10.7270/Q24B318F
Cholecystokinin A receptor
(Cavia porcellus)
BDBM50283845
(2-[(3R,5S,7R)-2-Oxo-7-phenyl-5-o-tolyl-3-(3-m-toly...)
Show SMILES Cc1cccc(NC(=O)N[C@@H]2C[C@@H](C[C@@H](N(CC(=O)Nc3ccccc3C)C2=O)c2ccccc2)c2ccccc2C)c1
Show InChI InChI=1S/C36H38N4O3/c1-24-12-11-17-29(20-24)37-36(43)39-32-21-28(30-18-9-7-13-25(30)2)22-33(27-15-5-4-6-16-27)40(35(32)42)23-34(41)38-31-19-10-8-14-26(31)3/h4-20,28,32-33H,21-23H2,1-3H3,(H,38,41)(H2,37,39,43)/t28-,32+,33+/m0/s1
Reactome pathway
n/an/a 1.10n/an/an/an/an/an/a
TBA
Curated by ChEMBL
Assay Description
Inhibitory activity against cholecystokinin-A (CCK-A) receptor in pancreas of guinea pig.
Bioorg Med Chem Lett 4: 2877-2882 (1994)
Article DOI: 10.1016/S0960-894X(01)80832-5
BindingDB Entry DOI: 10.7270/Q24B318F