BDBM50284034 (2R,6R)-2,6-Dibenzyl-4-hydroxy-heptanedioic acid bis-({(1S,2S)-2-[(isoquinoline-3-carbonyl)-amino]-cyclohexyl}-amide)::CHEMBL348047
SMILES: OC(C[C@@H](Cc1ccccc1)C(=O)N[C@H]1CCCC[C@@H]1NC(=O)c1cc2ccccc2cn1)C[C@@H](Cc1ccccc1)C(=O)N[C@H]1CCCC[C@@H]1NC(=O)c1cc2ccccc2cn1
InChI Key: InChIKey=OFDHFSOXKZFXTL-XQMIECQYSA-N
Data: 1 IC50
Activity Spreadsheet -- Enzyme Inhibition Constant Data from BindingDB
Found 1 hit for monomerid = 50284034
Trg + Lig
Ki
nM
ΔG°
kcal/mole
IC50
nM
Kd
nM
EC50/IC50
nM
koff
s-1
kon
M-1s-1
pHTemp
°C
Human immunodeficiency virus type 1 protease
(Human immunodeficiency virus type 1)
BDBM50284034
((2R,6R)-2,6-Dibenzyl-4-hydroxy-heptanedioic acid b...)
Show SMILES OC(C[C@@H](Cc1ccccc1)C(=O)N[C@H]1CCCC[C@@H]1NC(=O)c1cc2ccccc2cn1)C[C@@H](Cc1ccccc1)C(=O)N[C@H]1CCCC[C@@H]1NC(=O)c1cc2ccccc2cn1
Show InChI InChI=1S/C53H58N6O5/c60-43(29-41(27-35-15-3-1-4-16-35)50(61)56-44-23-11-13-25-46(44)58-52(63)48-31-37-19-7-9-21-39(37)33-54-48)30-42(28-36-17-5-2-6-18-36)51(62)57-45-24-12-14-26-47(45)59-53(64)49-32-38-20-8-10-22-40(38)34-55-49/h1-10,15-22,31-34,41-47,60H,11-14,23-30H2,(H,56,61)(H,57,62)(H,58,63)(H,59,64)/t41-,42-,44+,45+,46+,47+/m1/s1
n/an/a 45n/an/an/an/an/an/a
TBA
Curated by ChEMBL
Assay Description
Compound was tested for inhibitory activity against recombinant HIV-1 protease using 125 I-SPA (scintillation proximity assay)
Bioorg Med Chem Lett 4: 583-588 (1994)
Article DOI: 10.1016/S0960-894X(01)80159-1
BindingDB Entry DOI: 10.7270/Q2Q24061