BDBM50284036 (2R,6R)-2,6-Dibenzyl-4-hydroxy-heptanedioic acid bis-({(1S,2S)-2-[(quinoline-2-carbonyl)-amino]-cyclohexyl}-amide)::CHEMBL345868
SMILES: OC(C[C@@H](Cc1ccccc1)C(=O)N[C@H]1CCCC[C@@H]1NC(=O)c1ccc2ccccc2n1)C[C@@H](Cc1ccccc1)C(=O)N[C@H]1CCCC[C@@H]1NC(=O)c1ccc2ccccc2n1
InChI Key: InChIKey=SURWJUSOPZODJW-GJAPSMEESA-N
Data: 1 IC50
Activity Spreadsheet -- Enzyme Inhibition Constant Data from BindingDB
Found 1 hit for monomerid = 50284036
Trg + Lig
Ki
nM
ΔG°
kcal/mole
IC50
nM
Kd
nM
EC50/IC50
nM
koff
s-1
kon
M-1s-1
pHTemp
°C
Human immunodeficiency virus type 1 protease
(Human immunodeficiency virus type 1)
BDBM50284036
((2R,6R)-2,6-Dibenzyl-4-hydroxy-heptanedioic acid b...)
Show SMILES OC(C[C@@H](Cc1ccccc1)C(=O)N[C@H]1CCCC[C@@H]1NC(=O)c1ccc2ccccc2n1)C[C@@H](Cc1ccccc1)C(=O)N[C@H]1CCCC[C@@H]1NC(=O)c1ccc2ccccc2n1
Show InChI InChI=1S/C53H58N6O5/c60-41(33-39(31-35-15-3-1-4-16-35)50(61)56-44-23-11-13-25-46(44)58-52(63)48-29-27-37-19-7-9-21-42(37)54-48)34-40(32-36-17-5-2-6-18-36)51(62)57-45-24-12-14-26-47(45)59-53(64)49-30-28-38-20-8-10-22-43(38)55-49/h1-10,15-22,27-30,39-41,44-47,60H,11-14,23-26,31-34H2,(H,56,61)(H,57,62)(H,58,63)(H,59,64)/t39-,40-,44+,45+,46+,47+/m1/s1
n/an/a 40n/an/an/an/an/an/a
TBA
Curated by ChEMBL
Assay Description
Compound was tested for inhibitory activity against recombinant HIV-1 protease using 125 I-SPA (scintillation proximity assay)
Bioorg Med Chem Lett 4: 583-588 (1994)
Article DOI: 10.1016/S0960-894X(01)80159-1
BindingDB Entry DOI: 10.7270/Q2Q24061