BDBM50284779 CHEMBL36146::Z-Phe-Tyr-H
SMILES: OC(=O)[C@H](Cc1ccc(O)cc1)NC(=O)[C@H](Cc1ccccc1)NC(=O)OCc1ccccc1
InChI Key: InChIKey=PGOQBJBMASKTEL-GOTSBHOMSA-N
Data: 2 IC50
Activity Spreadsheet -- Enzyme Inhibition Constant Data from BindingDB
Found 2 hits for monomerid = 50284779
Trg + Lig
Ki
nM
ΔG°
kcal/mole
IC50
nM
Kd
nM
EC50/IC50
nM
koff
s-1
kon
M-1s-1
pHTemp
°C
Calpain-2 (m-Calpain)
(Homo sapiens (Human))
BDBM50284779
(CHEMBL36146 | Z-Phe-Tyr-H)
Show SMILES OC(=O)[C@H](Cc1ccc(O)cc1)NC(=O)[C@H](Cc1ccccc1)NC(=O)OCc1ccccc1
Show InChI InChI=1S/C26H26N2O6/c29-21-13-11-19(12-14-21)16-23(25(31)32)27-24(30)22(15-18-7-3-1-4-8-18)28-26(33)34-17-20-9-5-2-6-10-20/h1-14,22-23,29H,15-17H2,(H,27,30)(H,28,33)(H,31,32)/t22-,23-/m0/s1
n/an/a 184n/an/an/an/an/an/a
TBA
Curated by ChEMBL
Assay Description
Compound was tested for its inhibitory activity against calpain 2
Bioorg Med Chem Lett 5: 1501-1504 (1995)
Article DOI: 10.1016/0960-894X(95)00236-M
BindingDB Entry DOI: 10.7270/Q23N23V9
Cathepsin B
(Homo sapiens (Human))
BDBM50284779
(CHEMBL36146 | Z-Phe-Tyr-H)
Show SMILES OC(=O)[C@H](Cc1ccc(O)cc1)NC(=O)[C@H](Cc1ccccc1)NC(=O)OCc1ccccc1
Show InChI InChI=1S/C26H26N2O6/c29-21-13-11-19(12-14-21)16-23(25(31)32)27-24(30)22(15-18-7-3-1-4-8-18)28-26(33)34-17-20-9-5-2-6-10-20/h1-14,22-23,29H,15-17H2,(H,27,30)(H,28,33)(H,31,32)/t22-,23-/m0/s1
Reactome pathway
n/an/a 85n/an/an/an/an/an/a
TBA
Curated by ChEMBL
Assay Description
Compound was tested for its inhibitory activity against cathepsin B
Bioorg Med Chem Lett 5: 1501-1504 (1995)
Article DOI: 10.1016/0960-894X(95)00236-M
BindingDB Entry DOI: 10.7270/Q23N23V9