BDBM50284797 7-Methyl-6,7,7a,8-tetrahydro-5H-benzo[g][1,3]dioxolo[4',5':4,5]benzo[1,2,3-de]quinoline::CHEMBL36654::GNF-Pf-4466::cid_235224
SMILES: CN1CCc2cc3OCOc3c3-c4ccccc4CC1c23
InChI Key: InChIKey=JCTYWRARKVGOBK-UHFFFAOYSA-N
Data: 4 KI  5 IC50  2 EC50
Activity Spreadsheet -- Enzyme Inhibition Constant Data from BindingDB
Found 11 hits for monomerid = 50284797
Trg + Lig
Ki
nM
ΔG°
kcal/mole
IC50
nM
Kd
nM
EC50/IC50
nM
koff
s-1
kon
M-1s-1
pHTemp
°C
D(2) dopamine receptor
(Rattus norvegicus (rat))
BDBM50284797
(7-Methyl-6,7,7a,8-tetrahydro-5H-benzo[g][1,3]dioxo...)
Show SMILES CN1CCc2cc3OCOc3c3-c4ccccc4CC1c23
Show InChI InChI=1S/C18H17NO2/c1-19-7-6-12-9-15-18(21-10-20-15)17-13-5-3-2-4-11(13)8-14(19)16(12)17/h2-5,9,14H,6-8,10H2,1H3
Reactome pathway
83n/an/an/an/an/an/an/an/a
Universidad de Valencia
Curated by ChEMBL
Assay Description
Displacement of [3H]-raclopride from D2 receptor of Wistar rat striatal membranes after 1 hr by liquid scintillation counting
Bioorg Med Chem Lett 23: 4824-7 (2013)
Article DOI: 10.1016/j.bmcl.2013.06.078
BindingDB Entry DOI: 10.7270/Q2BK1G9S
D(2) dopamine receptor
(Rattus norvegicus (rat))
BDBM50284797
(7-Methyl-6,7,7a,8-tetrahydro-5H-benzo[g][1,3]dioxo...)
Show SMILES CN1CCc2cc3OCOc3c3-c4ccccc4CC1c23
Show InChI InChI=1S/C18H17NO2/c1-19-7-6-12-9-15-18(21-10-20-15)17-13-5-3-2-4-11(13)8-14(19)16(12)17/h2-5,9,14H,6-8,10H2,1H3
Reactome pathway
84n/an/an/an/an/an/an/an/a
Universidad de Valencia
Curated by ChEMBL
Assay Description
Displacement of [3H]-raclopride from D2 receptor of Wistar rat striatal membranes after 1 hr by liquid scintillation counting
Bioorg Med Chem Lett 23: 4824-7 (2013)
Article DOI: 10.1016/j.bmcl.2013.06.078
BindingDB Entry DOI: 10.7270/Q2BK1G9S
D(1A) dopamine receptor
(RAT)
BDBM50284797
(7-Methyl-6,7,7a,8-tetrahydro-5H-benzo[g][1,3]dioxo...)
Show SMILES CN1CCc2cc3OCOc3c3-c4ccccc4CC1c23
Show InChI InChI=1S/C18H17NO2/c1-19-7-6-12-9-15-18(21-10-20-15)17-13-5-3-2-4-11(13)8-14(19)16(12)17/h2-5,9,14H,6-8,10H2,1H3
324n/an/an/an/an/an/an/an/a
Universidad de Valencia
Curated by ChEMBL
Assay Description
Displacement of [3H]-SCH23390 from D1 receptor of Wistar rat striatal membranes after 1 hr by liquid scintillation counting
Bioorg Med Chem Lett 23: 4824-7 (2013)
Article DOI: 10.1016/j.bmcl.2013.06.078
BindingDB Entry DOI: 10.7270/Q2BK1G9S
D(1A) dopamine receptor
(RAT)
BDBM50284797
(7-Methyl-6,7,7a,8-tetrahydro-5H-benzo[g][1,3]dioxo...)
Show SMILES CN1CCc2cc3OCOc3c3-c4ccccc4CC1c23
Show InChI InChI=1S/C18H17NO2/c1-19-7-6-12-9-15-18(21-10-20-15)17-13-5-3-2-4-11(13)8-14(19)16(12)17/h2-5,9,14H,6-8,10H2,1H3
377n/an/an/an/an/an/an/an/a
Universidad de Valencia
Curated by ChEMBL
Assay Description
Displacement of [3H]-SCH23390 from D1 receptor of Wistar rat striatal membranes after 1 hr by liquid scintillation counting
Bioorg Med Chem Lett 23: 4824-7 (2013)
Article DOI: 10.1016/j.bmcl.2013.06.078
BindingDB Entry DOI: 10.7270/Q2BK1G9S
Apoptotic peptidase activating factor 1
(Homo sapiens (Human))
BDBM50284797
(7-Methyl-6,7,7a,8-tetrahydro-5H-benzo[g][1,3]dioxo...)
Show SMILES CN1CCc2cc3OCOc3c3-c4ccccc4CC1c23
Show InChI InChI=1S/C18H17NO2/c1-19-7-6-12-9-15-18(21-10-20-15)17-13-5-3-2-4-11(13)8-14(19)16(12)17/h2-5,9,14H,6-8,10H2,1H3
Reactome pathway
PCBioAssay
n/an/a>1.00E+5n/an/an/an/an/an/a
Burnham Center for Chemical Genomics
Curated by PubChem BioAssay
Assay Description
Data Source: Sanford-Burnham Center for Chemical Genomics (SBCCG) Source Affiliation: Sanford-Burnham Medical Research Institute (SBIMR, San Diego, C...
PubChem Bioassay (2011)
BindingDB Entry DOI: 10.7270/Q2F18X8S
Protein tyrosine phosphatase receptor type C-associated protein
(Homo sapiens (Human))
BDBM50284797
(7-Methyl-6,7,7a,8-tetrahydro-5H-benzo[g][1,3]dioxo...)
Show SMILES CN1CCc2cc3OCOc3c3-c4ccccc4CC1c23
Show InChI InChI=1S/C18H17NO2/c1-19-7-6-12-9-15-18(21-10-20-15)17-13-5-3-2-4-11(13)8-14(19)16(12)17/h2-5,9,14H,6-8,10H2,1H3
n/an/a 1.07E+5n/an/an/an/an/an/a
TBA
Curated by ChEMBL
Assay Description
In vitro inhibitory activity against recombinant CD45 protein tyrosine phosphatase
Bioorg Med Chem Lett 5: 1519-1522 (1995)
Article DOI: 10.1016/0960-894X(95)00250-W
BindingDB Entry DOI: 10.7270/Q2V69K2S
Apoptotic peptidase activating factor 1
(Homo sapiens (Human))
BDBM50284797
(7-Methyl-6,7,7a,8-tetrahydro-5H-benzo[g][1,3]dioxo...)
Show SMILES CN1CCc2cc3OCOc3c3-c4ccccc4CC1c23
Show InChI InChI=1S/C18H17NO2/c1-19-7-6-12-9-15-18(21-10-20-15)17-13-5-3-2-4-11(13)8-14(19)16(12)17/h2-5,9,14H,6-8,10H2,1H3
Reactome pathway
PCBioAssay
n/an/a 1.02E+4n/an/an/an/an/an/a
Burnham Center for Chemical Genomics
Curated by PubChem BioAssay
Assay Description
Data Source: Sanford-Burnham Center for Chemical Genomics (SBCCG) Source Affiliation: Sanford-Burnham Medical Research Institute (SBIMR, San Diego, C...
PubChem Bioassay (2011)
BindingDB Entry DOI: 10.7270/Q2JS9NZB
Caspase-9
(Homo sapiens (Human))
BDBM50284797
(7-Methyl-6,7,7a,8-tetrahydro-5H-benzo[g][1,3]dioxo...)
Show SMILES CN1CCc2cc3OCOc3c3-c4ccccc4CC1c23
Show InChI InChI=1S/C18H17NO2/c1-19-7-6-12-9-15-18(21-10-20-15)17-13-5-3-2-4-11(13)8-14(19)16(12)17/h2-5,9,14H,6-8,10H2,1H3
NCI pathway
Reactome pathway
PCBioAssay
n/an/a 2.73E+3n/an/an/an/an/an/a
Burnham Center for Chemical Genomics
Curated by PubChem BioAssay
Assay Description
Data Source: Sanford-Burnham Center for Chemical Genomics (SBCCG) Source Affiliation: Sanford-Burnham Medical Research Institute (SBIMR, San Diego, C...
PubChem Bioassay (2011)
BindingDB Entry DOI: 10.7270/Q25M647F
RecName: Full=Zinc finger protein mex-5
(Caenorhabditis elegans)
BDBM50284797
(7-Methyl-6,7,7a,8-tetrahydro-5H-benzo[g][1,3]dioxo...)
Show SMILES CN1CCc2cc3OCOc3c3-c4ccccc4CC1c23
Show InChI InChI=1S/C18H17NO2/c1-19-7-6-12-9-15-18(21-10-20-15)17-13-5-3-2-4-11(13)8-14(19)16(12)17/h2-5,9,14H,6-8,10H2,1H3
PCBioAssay
n/an/an/an/a 2.15E+4n/an/an/an/a
Broad Institute
Curated by PubChem BioAssay
Assay Description
Broad Institute: MLPCN maternal gene expression Project ID: 2024 Keywords: Zinc finger, C. elegans, maternal gene expression, RNA-protein interac...
PubChem Bioassay (2009)
BindingDB Entry DOI: 10.7270/Q2D798VP
POsterior Segregation family member (pos-1)
(Caenorhabditis elegans)
BDBM50284797
(7-Methyl-6,7,7a,8-tetrahydro-5H-benzo[g][1,3]dioxo...)
Show SMILES CN1CCc2cc3OCOc3c3-c4ccccc4CC1c23
Show InChI InChI=1S/C18H17NO2/c1-19-7-6-12-9-15-18(21-10-20-15)17-13-5-3-2-4-11(13)8-14(19)16(12)17/h2-5,9,14H,6-8,10H2,1H3
PCBioAssay
n/an/an/an/a 1.68E+4n/an/an/an/a
Broad Institute
Curated by PubChem BioAssay
Assay Description
Broad Institute: MLPCN maternal gene expression Project ID: 2024 Keywords: Zinc finger, C. elegans, maternal gene expression, RNA-protein interac...
PubChem Bioassay (2009)
BindingDB Entry DOI: 10.7270/Q28G8J4C
Methyl-CpG binding domain protein 2
(Homo sapiens (Human))
BDBM50284797
(7-Methyl-6,7,7a,8-tetrahydro-5H-benzo[g][1,3]dioxo...)
Show SMILES CN1CCc2cc3OCOc3c3-c4ccccc4CC1c23
Show InChI InChI=1S/C18H17NO2/c1-19-7-6-12-9-15-18(21-10-20-15)17-13-5-3-2-4-11(13)8-14(19)16(12)17/h2-5,9,14H,6-8,10H2,1H3
Reactome pathway
PCBioAssay
n/an/a 4.70E+3n/an/an/an/an/an/a
The Scripps Research Institute Molecular Screening Center
Curated by PubChem BioAssay
Assay Description
Source (MLPCN Center Name): The Scripps Research Institute Molecular Screening Center Affiliation: The Scripps Research Institute, TSRI Assay Provide...
PubChem Bioassay (2013)
BindingDB Entry DOI: 10.7270/Q20K2778