BDBM50285009 3-{3-[(3R,5R)-1-(tert-Butylcarbamoyl-methyl)-5-cyclohexyl-8-methyl-2-oxo-2,3,4,5-tetrahydro-1H-benzo[b]azepin-3-yl]-ureido}-benzoic acid::CHEMBL431919
SMILES: Cc1ccc2[C@H](C[C@@H](NC(=O)Nc3cccc(c3)C(O)=O)C(=O)N(CC(=O)NC(C)(C)C)c2c1)C1CCCCC1
InChI Key: InChIKey=VKDAZGQQWPSRFA-JWQCQUIFSA-N
Data: 4 IC50
Activity Spreadsheet -- Enzyme Inhibition Constant Data from BindingDB
Found 4 hits for monomerid = 50285009
Trg + Lig
Ki
nM
ΔG°
kcal/mole
IC50
nM
Kd
nM
EC50/IC50
nM
koff
s-1
kon
M-1s-1
pHTemp
°C
Cholecystokinin receptor
(Homo sapiens (Human))
BDBM50285009
(3-{3-[(3R,5R)-1-(tert-Butylcarbamoyl-methyl)-5-cyc...)
Show SMILES Cc1ccc2[C@H](C[C@@H](NC(=O)Nc3cccc(c3)C(O)=O)C(=O)N(CC(=O)NC(C)(C)C)c2c1)C1CCCCC1
Show InChI InChI=1S/C31H40N4O5/c1-19-13-14-23-24(20-9-6-5-7-10-20)17-25(33-30(40)32-22-12-8-11-21(16-22)29(38)39)28(37)35(26(23)15-19)18-27(36)34-31(2,3)4/h8,11-16,20,24-25H,5-7,9-10,17-18H2,1-4H3,(H,34,36)(H,38,39)(H2,32,33,40)/t24-,25-/m1/s1
Reactome pathway
n/an/a 0.100n/an/an/an/an/an/a
TBA
Curated by ChEMBL
Assay Description
Binding activity towards cholecystokinin-B (CCK-B) receptor in guinea pig cortex
Bioorg Med Chem Lett 5: 1933-1936 (1995)
Article DOI: 10.1016/0960-894X(95)00327-P
BindingDB Entry DOI: 10.7270/Q22Z15H2
Cholecystokinin A receptor
(Cavia porcellus)
BDBM50285009
(3-{3-[(3R,5R)-1-(tert-Butylcarbamoyl-methyl)-5-cyc...)
Show SMILES Cc1ccc2[C@H](C[C@@H](NC(=O)Nc3cccc(c3)C(O)=O)C(=O)N(CC(=O)NC(C)(C)C)c2c1)C1CCCCC1
Show InChI InChI=1S/C31H40N4O5/c1-19-13-14-23-24(20-9-6-5-7-10-20)17-25(33-30(40)32-22-12-8-11-21(16-22)29(38)39)28(37)35(26(23)15-19)18-27(36)34-31(2,3)4/h8,11-16,20,24-25H,5-7,9-10,17-18H2,1-4H3,(H,34,36)(H,38,39)(H2,32,33,40)/t24-,25-/m1/s1
Reactome pathway
n/an/a 1.40E+3n/an/an/an/an/an/a
TBA
Curated by ChEMBL
Assay Description
Binding activity towards cholecystokinin-B (CCK-B) receptor in guinea pig cortex
Bioorg Med Chem Lett 5: 1933-1936 (1995)
Article DOI: 10.1016/0960-894X(95)00327-P
BindingDB Entry DOI: 10.7270/Q22Z15H2
Cholecystokinin receptor
(Homo sapiens (Human))
BDBM50285009
(3-{3-[(3R,5R)-1-(tert-Butylcarbamoyl-methyl)-5-cyc...)
Show SMILES Cc1ccc2[C@H](C[C@@H](NC(=O)Nc3cccc(c3)C(O)=O)C(=O)N(CC(=O)NC(C)(C)C)c2c1)C1CCCCC1
Show InChI InChI=1S/C31H40N4O5/c1-19-13-14-23-24(20-9-6-5-7-10-20)17-25(33-30(40)32-22-12-8-11-21(16-22)29(38)39)28(37)35(26(23)15-19)18-27(36)34-31(2,3)4/h8,11-16,20,24-25H,5-7,9-10,17-18H2,1-4H3,(H,34,36)(H,38,39)(H2,32,33,40)/t24-,25-/m1/s1
Reactome pathway
n/an/a 0.200n/an/an/an/an/an/a
TBA
Curated by ChEMBL
Assay Description
Binding activity towards cholecystokinin-A (CCK-A) receptor in guinea pig pancreas
Bioorg Med Chem Lett 5: 1933-1936 (1995)
Article DOI: 10.1016/0960-894X(95)00327-P
BindingDB Entry DOI: 10.7270/Q22Z15H2
Cholecystokinin A receptor
(Cavia porcellus)
BDBM50285009
(3-{3-[(3R,5R)-1-(tert-Butylcarbamoyl-methyl)-5-cyc...)
Show SMILES Cc1ccc2[C@H](C[C@@H](NC(=O)Nc3cccc(c3)C(O)=O)C(=O)N(CC(=O)NC(C)(C)C)c2c1)C1CCCCC1
Show InChI InChI=1S/C31H40N4O5/c1-19-13-14-23-24(20-9-6-5-7-10-20)17-25(33-30(40)32-22-12-8-11-21(16-22)29(38)39)28(37)35(26(23)15-19)18-27(36)34-31(2,3)4/h8,11-16,20,24-25H,5-7,9-10,17-18H2,1-4H3,(H,34,36)(H,38,39)(H2,32,33,40)/t24-,25-/m1/s1
Reactome pathway
n/an/a 2.30E+3n/an/an/an/an/an/a
TBA
Curated by ChEMBL
Assay Description
Compound was tested for its ability to displace [I-125]-glucagon from the glucagon receptor
Bioorg Med Chem Lett 5: 1933-1936 (1995)
Article DOI: 10.1016/0960-894X(95)00327-P
BindingDB Entry DOI: 10.7270/Q22Z15H2