BDBM50285011 CHEMBL294252::N-tert-Butyl-2-{(3R,5R)-5-cyclohexyl-3-[3-(3-methanesulfonylaminocarbonyl-phenyl)-ureido]-8-methyl-2-oxo-2,3,4,5-tetrahydro-benzo[b]azepin-1-yl}-acetamide
SMILES: Cc1ccc2[C@H](C[C@@H](NC(=O)Nc3cccc(c3)C(=O)NS(C)(=O)=O)C(=O)N(CC(=O)NC(C)(C)C)c2c1)C1CCCCC1
InChI Key: InChIKey=SFJVTILNSUYYFI-CLJLJLNGSA-N
Data: 2 IC50
Activity Spreadsheet -- Enzyme Inhibition Constant Data from BindingDB
Found 2 hits for monomerid = 50285011
Trg + Lig
Ki
nM
ΔG°
kcal/mole
IC50
nM
Kd
nM
EC50/IC50
nM
koff
s-1
kon
M-1s-1
pHTemp
°C
Cholecystokinin receptor
(Homo sapiens (Human))
BDBM50285011
(CHEMBL294252 | N-tert-Butyl-2-{(3R,5R)-5-cyclohexy...)
Show SMILES Cc1ccc2[C@H](C[C@@H](NC(=O)Nc3cccc(c3)C(=O)NS(C)(=O)=O)C(=O)N(CC(=O)NC(C)(C)C)c2c1)C1CCCCC1
Show InChI InChI=1S/C32H43N5O6S/c1-20-14-15-24-25(21-10-7-6-8-11-21)18-26(30(40)37(27(24)16-20)19-28(38)35-32(2,3)4)34-31(41)33-23-13-9-12-22(17-23)29(39)36-44(5,42)43/h9,12-17,21,25-26H,6-8,10-11,18-19H2,1-5H3,(H,35,38)(H,36,39)(H2,33,34,41)/t25-,26-/m1/s1
Reactome pathway
n/an/a 0.260n/an/an/an/an/an/a
TBA
Curated by ChEMBL
Assay Description
Binding activity towards cholecystokinin-B (CCK-B) receptor in guinea pig cortex
Bioorg Med Chem Lett 5: 1933-1936 (1995)
Article DOI: 10.1016/0960-894X(95)00327-P
BindingDB Entry DOI: 10.7270/Q22Z15H2
Cholecystokinin A receptor
(Cavia porcellus)
BDBM50285011
(CHEMBL294252 | N-tert-Butyl-2-{(3R,5R)-5-cyclohexy...)
Show SMILES Cc1ccc2[C@H](C[C@@H](NC(=O)Nc3cccc(c3)C(=O)NS(C)(=O)=O)C(=O)N(CC(=O)NC(C)(C)C)c2c1)C1CCCCC1
Show InChI InChI=1S/C32H43N5O6S/c1-20-14-15-24-25(21-10-7-6-8-11-21)18-26(30(40)37(27(24)16-20)19-28(38)35-32(2,3)4)34-31(41)33-23-13-9-12-22(17-23)29(39)36-44(5,42)43/h9,12-17,21,25-26H,6-8,10-11,18-19H2,1-5H3,(H,35,38)(H,36,39)(H2,33,34,41)/t25-,26-/m1/s1
Reactome pathway
n/an/a 520n/an/an/an/an/an/a
TBA
Curated by ChEMBL
Assay Description
Binding activity towards cholecystokinin-A (CCK-A) receptor in guinea pig pancreas
Bioorg Med Chem Lett 5: 1933-1936 (1995)
Article DOI: 10.1016/0960-894X(95)00327-P
BindingDB Entry DOI: 10.7270/Q22Z15H2