null
SMILES: CN1CC[C@]2(C)[C@H]1N(C)c1ccc(OC(=O)NCCCCCCCCCCCN3CCOCC3)cc21
InChI Key: InChIKey=LKBQETKGWDWQQB-PXJZQJOASA-N
Activity Spreadsheet -- Enzyme Inhibition Constant Data from BindingDB
Found 1 hit for monomerid = 50285179
Trg + Lig
Ki
nM
ΔG°
kcal/mole
IC50
nM
Kd
nM
EC50/IC50
nM
koff
s-1
kon
M-1s-1
pHTemp
°C
Acetylcholinesterase
(Homo sapiens (Human))
BDBM50285179
((11-Morpholin-4-yl-undecyl)-carbamic acid (3aS,8aR...)
Show SMILES CN1CC[C@]2(C)[C@H]1N(C)c1ccc(OC(=O)NCCCCCCCCCCCN3CCOCC3)cc21
Show InChI InChI=1S/C29H48N4O3/c1-29-15-18-31(2)27(29)32(3)26-14-13-24(23-25(26)29)36-28(34)30-16-11-9-7-5-4-6-8-10-12-17-33-19-21-35-22-20-33/h13-14,23,27H,4-12,15-22H2,1-3H3,(H,30,34)/t27-,29+/m1/s1
NCI pathway
Reactome pathway
n/an/a 40n/an/an/an/an/an/a
TBA
Curated by ChEMBL
Assay Description
Inhibition of Acetylcholinesterase(AChE) from human RBC
Bioorg Med Chem Lett 5: 2077-2080 (1995)
Article DOI: 10.1016/0960-894X(95)00371-Y
BindingDB Entry DOI: 10.7270/Q2NP24CR