BDBM50285250 4-(2-Carboxy-6-hydroxy-benzoyl)-3,5-dihydroxy-benzoic acid (S)-2-(4-hydroxy-benzoylamino)-cyclopentyl ester::CHEMBL71331
SMILES: OC(=O)c1cccc(O)c1C(=O)c1c(O)cc(cc1O)C(=O)O[C@H]1CCCC1NC(=O)c1ccc(O)cc1
InChI Key: InChIKey=IRGJDPZJEUYSKS-LFABVHOISA-N
Data: 8 IC50
Activity Spreadsheet -- Enzyme Inhibition Constant Data from BindingDB
Found 8 hits for monomerid = 50285250
Trg + Lig
Ki
nM
ΔG°
kcal/mole
IC50
nM
Kd
nM
EC50/IC50
nM
koff
s-1
kon
M-1s-1
pHTemp
°C
Protein kinase C (PKC)
(Homo sapiens (Human))
BDBM50285250
(4-(2-Carboxy-6-hydroxy-benzoyl)-3,5-dihydroxy-benz...)
Show SMILES OC(=O)c1cccc(O)c1C(=O)c1c(O)cc(cc1O)C(=O)O[C@H]1CCCC1NC(=O)c1ccc(O)cc1
Show InChI InChI=1S/C27H23NO10/c29-15-9-7-13(8-10-15)25(34)28-17-4-2-6-21(17)38-27(37)14-11-19(31)23(20(32)12-14)24(33)22-16(26(35)36)3-1-5-18(22)30/h1,3,5,7-12,17,21,29-32H,2,4,6H2,(H,28,34)(H,35,36)/t17?,21-/m0/s1
NCI pathway
Reactome pathway
n/an/a 2.20E+4n/an/an/an/an/an/a
Sphinx Laboratories
Assay Description
Inhibition of Protein kinase C zeta
Bioorg Med Chem Lett 5: 2211-6 (1995)
Article DOI: 10.1016/0960-894X(95)00382-4
BindingDB Entry DOI: 10.7270/Q2QR4V9M
cAMP-dependent protein kinase (PKA)
(Homo sapiens (Human))
BDBM50285250
(4-(2-Carboxy-6-hydroxy-benzoyl)-3,5-dihydroxy-benz...)
Show SMILES OC(=O)c1cccc(O)c1C(=O)c1c(O)cc(cc1O)C(=O)O[C@H]1CCCC1NC(=O)c1ccc(O)cc1
Show InChI InChI=1S/C27H23NO10/c29-15-9-7-13(8-10-15)25(34)28-17-4-2-6-21(17)38-27(37)14-11-19(31)23(20(32)12-14)24(33)22-16(26(35)36)3-1-5-18(22)30/h1,3,5,7-12,17,21,29-32H,2,4,6H2,(H,28,34)(H,35,36)/t17?,21-/m0/s1
n/an/a 30n/an/an/an/an/an/a
Sphinx Laboratories
Assay Description
PKC was assayed by quantitating the incorporation of 32P from [gamma-32P]ATP into histone type IIIs.
Bioorg Med Chem Lett 5: 2211-6 (1995)
Article DOI: 10.1016/0960-894X(95)00382-4
BindingDB Entry DOI: 10.7270/Q2QR4V9M
PKC alpha and beta-2
(Homo sapiens (Human))
BDBM50285250
(4-(2-Carboxy-6-hydroxy-benzoyl)-3,5-dihydroxy-benz...)
Show SMILES OC(=O)c1cccc(O)c1C(=O)c1c(O)cc(cc1O)C(=O)O[C@H]1CCCC1NC(=O)c1ccc(O)cc1
Show InChI InChI=1S/C27H23NO10/c29-15-9-7-13(8-10-15)25(34)28-17-4-2-6-21(17)38-27(37)14-11-19(31)23(20(32)12-14)24(33)22-16(26(35)36)3-1-5-18(22)30/h1,3,5,7-12,17,21,29-32H,2,4,6H2,(H,28,34)(H,35,36)/t17?,21-/m0/s1
NCI pathway
Reactome pathway
n/an/a 40n/an/an/an/an/an/a
Sphinx Laboratories
Assay Description
Inhibition of Protein kinase C delta
Bioorg Med Chem Lett 5: 2211-6 (1995)
Article DOI: 10.1016/0960-894X(95)00382-4
BindingDB Entry DOI: 10.7270/Q2QR4V9M
Protein kinase C delta type
(Homo sapiens (Human))
BDBM50285250
(4-(2-Carboxy-6-hydroxy-benzoyl)-3,5-dihydroxy-benz...)
Show SMILES OC(=O)c1cccc(O)c1C(=O)c1c(O)cc(cc1O)C(=O)O[C@H]1CCCC1NC(=O)c1ccc(O)cc1
Show InChI InChI=1S/C27H23NO10/c29-15-9-7-13(8-10-15)25(34)28-17-4-2-6-21(17)38-27(37)14-11-19(31)23(20(32)12-14)24(33)22-16(26(35)36)3-1-5-18(22)30/h1,3,5,7-12,17,21,29-32H,2,4,6H2,(H,28,34)(H,35,36)/t17?,21-/m0/s1
NCI pathway
Reactome pathway
n/an/a 1n/an/an/an/an/an/a
Sphinx Laboratories
Assay Description
Inhibition of Protein kinase C delta
Bioorg Med Chem Lett 5: 2211-6 (1995)
Article DOI: 10.1016/0960-894X(95)00382-4
BindingDB Entry DOI: 10.7270/Q2QR4V9M
Protein kinase C, eta
(Homo sapiens (Human))
BDBM50285250
(4-(2-Carboxy-6-hydroxy-benzoyl)-3,5-dihydroxy-benz...)
Show SMILES OC(=O)c1cccc(O)c1C(=O)c1c(O)cc(cc1O)C(=O)O[C@H]1CCCC1NC(=O)c1ccc(O)cc1
Show InChI InChI=1S/C27H23NO10/c29-15-9-7-13(8-10-15)25(34)28-17-4-2-6-21(17)38-27(37)14-11-19(31)23(20(32)12-14)24(33)22-16(26(35)36)3-1-5-18(22)30/h1,3,5,7-12,17,21,29-32H,2,4,6H2,(H,28,34)(H,35,36)/t17?,21-/m0/s1
NCI pathway
Reactome pathway
n/an/a 1n/an/an/an/an/an/a
Sphinx Laboratories
Assay Description
Inhibition of Protein kinase C eta
Bioorg Med Chem Lett 5: 2211-6 (1995)
Article DOI: 10.1016/0960-894X(95)00382-4
BindingDB Entry DOI: 10.7270/Q2QR4V9M
Protein kinase C alpha type
(Homo sapiens (Human))
BDBM50285250
(4-(2-Carboxy-6-hydroxy-benzoyl)-3,5-dihydroxy-benz...)
Show SMILES OC(=O)c1cccc(O)c1C(=O)c1c(O)cc(cc1O)C(=O)O[C@H]1CCCC1NC(=O)c1ccc(O)cc1
Show InChI InChI=1S/C27H23NO10/c29-15-9-7-13(8-10-15)25(34)28-17-4-2-6-21(17)38-27(37)14-11-19(31)23(20(32)12-14)24(33)22-16(26(35)36)3-1-5-18(22)30/h1,3,5,7-12,17,21,29-32H,2,4,6H2,(H,28,34)(H,35,36)/t17?,21-/m0/s1
NCI pathway
Reactome pathway
n/an/a 40n/an/an/an/an/an/a
Sphinx Laboratories
Assay Description
Inhibition of Protein kinase C alpha
Bioorg Med Chem Lett 5: 2211-6 (1995)
Article DOI: 10.1016/0960-894X(95)00382-4
BindingDB Entry DOI: 10.7270/Q2QR4V9M
Protein kinase C, epsilon
(Homo sapiens (Human))
BDBM50285250
(4-(2-Carboxy-6-hydroxy-benzoyl)-3,5-dihydroxy-benz...)
Show SMILES OC(=O)c1cccc(O)c1C(=O)c1c(O)cc(cc1O)C(=O)O[C@H]1CCCC1NC(=O)c1ccc(O)cc1
Show InChI InChI=1S/C27H23NO10/c29-15-9-7-13(8-10-15)25(34)28-17-4-2-6-21(17)38-27(37)14-11-19(31)23(20(32)12-14)24(33)22-16(26(35)36)3-1-5-18(22)30/h1,3,5,7-12,17,21,29-32H,2,4,6H2,(H,28,34)(H,35,36)/t17?,21-/m0/s1
NCI pathway
Reactome pathway
n/an/a 50n/an/an/an/an/an/a
Sphinx Laboratories
Assay Description
Inhibition of Protein kinase C epsilon
Bioorg Med Chem Lett 5: 2211-6 (1995)
Article DOI: 10.1016/0960-894X(95)00382-4
BindingDB Entry DOI: 10.7270/Q2QR4V9M
Protein kinase C, gamma
(Homo sapiens (Human))
BDBM50285250
(4-(2-Carboxy-6-hydroxy-benzoyl)-3,5-dihydroxy-benz...)
Show SMILES OC(=O)c1cccc(O)c1C(=O)c1c(O)cc(cc1O)C(=O)O[C@H]1CCCC1NC(=O)c1ccc(O)cc1
Show InChI InChI=1S/C27H23NO10/c29-15-9-7-13(8-10-15)25(34)28-17-4-2-6-21(17)38-27(37)14-11-19(31)23(20(32)12-14)24(33)22-16(26(35)36)3-1-5-18(22)30/h1,3,5,7-12,17,21,29-32H,2,4,6H2,(H,28,34)(H,35,36)/t17?,21-/m0/s1
NCI pathway
Reactome pathway
n/an/a 10n/an/an/an/an/an/a
Sphinx Laboratories
Assay Description
Inhibition Protein kinase C gamma
Bioorg Med Chem Lett 5: 2211-6 (1995)
Article DOI: 10.1016/0960-894X(95)00382-4
BindingDB Entry DOI: 10.7270/Q2QR4V9M