BDBM50285479 10,12-Dimethyl-tetradecanoic acid [6-[1,2-dihydroxy-2-(4-hydroxy-phenyl)-ethyl]-11,20,21,25-tetrahydroxy-15-(1-hydroxy-ethyl)-3-(1-hydroxy-3-methylamino-propyl)-2,5,8,14,17,23-hexaoxo-1,4,7,13,16,22-hexaaza-tricyclo[22.3.0.0*9,13*]heptacos-18-yl]-amide::CHEMBL408820
SMILES: CCC(C)CC(C)CCCCCCCCC(=O)N[C@H]1C[C@@H](O)[C@@H](O)NC(=O)[C@@H]2[C@@H](O)CCN2C(=O)[C@@H](NC(=O)[C@@H](NC(=O)[C@@H]2C[C@@H](O)CN2C(=O)[C@@H](NC1=O)[C@@H](C)O)[C@H](O)[C@@H](O)c1ccc(O)cc1)[C@H](O)CCNC
InChI Key: InChIKey=UUNNUVVNLDXCSN-SMJYJBDCSA-N
Data: 1 IC50
Activity Spreadsheet -- Enzyme Inhibition Constant Data from BindingDB
Found 1 hit for monomerid = 50285479
Trg + Lig
Ki
nM
ΔG°
kcal/mole
IC50
nM
Kd
nM
EC50/IC50
nM
koff
s-1
kon
M-1s-1
pHTemp
°C
Glucan Synthase
(Candida albicans (Yeast))
BDBM50285479
(10,12-Dimethyl-tetradecanoic acid [6-[1,2-dihydrox...)
Show SMILES CCC(C)CC(C)CCCCCCCCC(=O)N[C@H]1C[C@@H](O)[C@@H](O)NC(=O)[C@@H]2[C@@H](O)CCN2C(=O)[C@@H](NC(=O)[C@@H](NC(=O)[C@@H]2C[C@@H](O)CN2C(=O)[C@@H](NC1=O)[C@@H](C)O)[C@H](O)[C@@H](O)c1ccc(O)cc1)[C@H](O)CCNC
Show InChI InChI=1S/C51H84N8O16/c1-6-27(2)23-28(3)13-11-9-7-8-10-12-14-38(66)53-33-25-37(65)47(71)57-49(73)42-36(64)20-22-58(42)51(75)40(35(63)19-21-52-5)55-48(72)41(44(68)43(67)30-15-17-31(61)18-16-30)56-46(70)34-24-32(62)26-59(34)50(74)39(29(4)60)54-45(33)69/h15-18,27-29,32-37,39-44,47,52,60-65,67-68,71H,6-14,19-26H2,1-5H3,(H,53,66)(H,54,69)(H,55,72)(H,56,70)(H,57,73)/t27?,28?,29-,32-,33+,34+,35-,36+,37-,39+,40+,41+,42+,43+,44+,47-/m1/s1
n/an/a 7n/an/an/an/an/an/a
TBA
Curated by ChEMBL
Assay Description
Tested for inhibition of Beta-1,3-glucan synthase using a crude membrane of Candida albicans (MY 1208).
Bioorg Med Chem Lett 5: 2357-2362 (1995)
Article DOI: 10.1016/0960-894X(95)00407-K
BindingDB Entry DOI: 10.7270/Q29886Z7