BDBM50285480 10,12-Dimethyl-tetradecanoic acid {3-(2-cyano-1-hydroxy-ethyl)-11,20,25-trihydroxy-15-(1-hydroxy-ethyl)-6-[1-hydroxy-2-(4-hydroxy-phenyl)-ethyl]-2,5,8,14,17,23-hexaoxo-1,4,7,13,16,22-hexaaza-tricyclo[22.3.0.0*9,13*]heptacos-18-yl}-amide::CHEMBL412347
SMILES: CCC(C)CC(C)CCCCCCCCC(=O)N[C@H]1C[C@@H](O)CNC(=O)[C@@H]2[C@@H](O)CCN2C(=O)[C@@H](NC(=O)[C@@H](NC(=O)[C@@H]2C[C@@H](O)CN2C(=O)[C@@H](NC1=O)[C@@H](C)O)[C@H](O)Cc1ccc(O)cc1)[C@H](O)CC#N
InChI Key: InChIKey=PSKWLTSAHQXLES-KESYHRTFSA-N
Data: 1 IC50
Activity Spreadsheet -- Enzyme Inhibition Constant Data from BindingDB
Found 1 hit for monomerid = 50285480
Trg + Lig
Ki
nM
ΔG°
kcal/mole
IC50
nM
Kd
nM
EC50/IC50
nM
koff
s-1
kon
M-1s-1
pHTemp
°C
Glucan Synthase
(Candida albicans (Yeast))
BDBM50285480
(10,12-Dimethyl-tetradecanoic acid {3-(2-cyano-1-hy...)
Show SMILES CCC(C)CC(C)CCCCCCCCC(=O)N[C@H]1C[C@@H](O)CNC(=O)[C@@H]2[C@@H](O)CCN2C(=O)[C@@H](NC(=O)[C@@H](NC(=O)[C@@H]2C[C@@H](O)CN2C(=O)[C@@H](NC1=O)[C@@H](C)O)[C@H](O)Cc1ccc(O)cc1)[C@H](O)CC#N
Show InChI InChI=1S/C50H78N8O14/c1-5-28(2)22-29(3)12-10-8-6-7-9-11-13-40(66)53-35-24-33(61)26-52-48(70)44-38(64)19-21-57(44)50(72)43(37(63)18-20-51)56-47(69)42(39(65)23-31-14-16-32(60)17-15-31)55-46(68)36-25-34(62)27-58(36)49(71)41(30(4)59)54-45(35)67/h14-17,28-30,33-39,41-44,59-65H,5-13,18-19,21-27H2,1-4H3,(H,52,70)(H,53,66)(H,54,67)(H,55,68)(H,56,69)/t28?,29?,30-,33-,34-,35+,36+,37-,38+,39-,41+,42+,43+,44+/m1/s1
n/an/a 100n/an/an/an/an/an/a
TBA
Curated by ChEMBL
Assay Description
Tested for inhibition of Beta-1,3-glucan synthase using a crude membrane of Candida albicans (MY 1208).
Bioorg Med Chem Lett 5: 2357-2362 (1995)
Article DOI: 10.1016/0960-894X(95)00407-K
BindingDB Entry DOI: 10.7270/Q29886Z7