BDBM50285492 1N-[20-[3-di(cyanomethyl)amino-1-hydroxypropyl]-23-[1,2-dihydroxy-2-(4-hydroxyphenyl)ethyl]-2,11,12,15-tetrahydroxy-6-(1-hydroxyethyl)-5,8,14,19,22,25-hexaoxoperhydrodipyrrolo[2,1-c:2,1-l][1,4,7,10,13,16]hexaazacyclohenicosin-9-yl]-10,12-dimethyl::CHEMBL217306
SMILES: CCC(C)CC(C)CCCCCCCCC(=O)N[C@H]1C[C@@H](O)[C@@H](O)NC(=O)[C@@H]2[C@@H](O)CCN2C(=O)[C@@H](NC(=O)[C@@H](NC(=O)[C@@H]2C[C@@H](O)CN2C(=O)[C@@H](NC1=O)[C@@H](C)O)[C@H](O)[C@@H](O)c1ccc(O)cc1)[C@H](O)CCN(CC#N)CC#N
InChI Key: InChIKey=ZPAHMPZEUHFWRJ-ZELNKJOMSA-N
Data: 1 IC50
Activity Spreadsheet -- Enzyme Inhibition Constant Data from BindingDB
Found 1 hit for monomerid = 50285492
Trg + Lig
Ki
nM
ΔG°
kcal/mole
IC50
nM
Kd
nM
EC50/IC50
nM
koff
s-1
kon
M-1s-1
pHTemp
°C
Glucan Synthase
(Candida albicans (Yeast))
BDBM50285492
(1N-[20-[3-di(cyanomethyl)amino-1-hydroxypropyl]-23...)
Show SMILES CCC(C)CC(C)CCCCCCCCC(=O)N[C@H]1C[C@@H](O)[C@@H](O)NC(=O)[C@@H]2[C@@H](O)CCN2C(=O)[C@@H](NC(=O)[C@@H](NC(=O)[C@@H]2C[C@@H](O)CN2C(=O)[C@@H](NC1=O)[C@@H](C)O)[C@H](O)[C@@H](O)c1ccc(O)cc1)[C@H](O)CCN(CC#N)CC#N
Show InChI InChI=1S/C54H84N10O16/c1-5-30(2)26-31(3)12-10-8-6-7-9-11-13-41(71)57-36-28-40(70)50(76)61-52(78)45-39(69)19-23-63(45)54(80)43(38(68)18-22-62(24-20-55)25-21-56)59-51(77)44(47(73)46(72)33-14-16-34(66)17-15-33)60-49(75)37-27-35(67)29-64(37)53(79)42(32(4)65)58-48(36)74/h14-17,30-32,35-40,42-47,50,65-70,72-73,76H,5-13,18-19,22-29H2,1-4H3,(H,57,71)(H,58,74)(H,59,77)(H,60,75)(H,61,78)/t30?,31?,32-,35-,36+,37+,38-,39+,40-,42+,43+,44+,45+,46+,47+,50-/m1/s1
n/an/a>200n/an/an/an/an/an/a
TBA
Curated by ChEMBL
Assay Description
Tested for inhibition of Beta-1,3-glucan synthase using a crude membrane of Candida albicans (MY 1208).
Bioorg Med Chem Lett 5: 2357-2362 (1995)
Article DOI: 10.1016/0960-894X(95)00407-K
BindingDB Entry DOI: 10.7270/Q29886Z7