BDBM50285671 CHEMBL86063::{1-[(R)-1-{3-[(E)-2-(2,3-Dichloro-thieno[3,2-b]pyridin-5-yl)-vinyl]-phenyl}-3-(2-hydroxymethyl-phenyl)-propylsulfanylmethyl]-cyclopropyl}-acetic acid
SMILES: OCc1ccccc1CC[C@@H](SCC1(CC(O)=O)CC1)c1cccc(\C=C\c2ccc3sc(Cl)c(Cl)c3n2)c1
InChI Key: InChIKey=QZECKERBZPCVOV-GVODCENMSA-N
Data: 1 IC50
Activity Spreadsheet -- Enzyme Inhibition Constant Data from BindingDB
Found 1 hit for monomerid = 50285671
Trg + Lig
Ki
nM
ΔG°
kcal/mole
IC50
nM
Kd
nM
EC50/IC50
nM
koff
s-1
kon
M-1s-1
pHTemp
°C
Cysteinyl leukotriene receptor
(Homo sapiens (Human))
BDBM50285671
(CHEMBL86063 | {1-[(R)-1-{3-[(E)-2-(2,3-Dichloro-th...)
Show SMILES OCc1ccccc1CC[C@@H](SCC1(CC(O)=O)CC1)c1cccc(\C=C\c2ccc3sc(Cl)c(Cl)c3n2)c1
Show InChI InChI=1S/C31H29Cl2NO3S2/c32-28-29-26(39-30(28)33)13-11-24(34-29)10-8-20-4-3-7-22(16-20)25(38-19-31(14-15-31)17-27(36)37)12-9-21-5-1-2-6-23(21)18-35/h1-8,10-11,13,16,25,35H,9,12,14-15,17-19H2,(H,36,37)/b10-8+/t25-/m1/s1
Reactome pathway
n/an/a 0.720n/an/an/an/an/an/a
TBA
Curated by ChEMBL
Assay Description
Inhibition of binding of [ H]-LTD4 to DMSO differentiated U937 cell membranes
Bioorg Med Chem Lett 5: 2551-2556 (1995)
Article DOI: 10.1016/0960-894X(95)00448-3
BindingDB Entry DOI: 10.7270/Q2W37W8Q