BDBM50285977 CHEMBL99214::[(1R,2R)-3-((3aR,6S,7aS)-6-tert-Butylcarbamoyl-hexahydro-thieno[3,2-c]pyridin-5-yl)-2-hydroxy-1-phenylsulfanylmethyl-propyl]-carbamic acid (2R,3R)-2-methyl-1,1-dioxo-tetrahydro-1lambda*6*-thiophen-3-yl ester
SMILES: C[C@@H]1[C@@H](CCS1(=O)=O)OC(=O)N[C@@H](CSc1ccccc1)[C@H](O)CN1C[C@H]2CCS[C@H]2C[C@H]1C(=O)NC(C)(C)C
InChI Key: InChIKey=SSAWLODCPROYGG-GSFGBMHFSA-N
Data: 1 IC50
Activity Spreadsheet -- Enzyme Inhibition Constant Data from BindingDB
Found 1 hit for monomerid = 50285977
Trg + Lig
Ki
nM
ΔG°
kcal/mole
IC50
nM
Kd
nM
EC50/IC50
nM
koff
s-1
kon
M-1s-1
pHTemp
°C
Human immunodeficiency virus type 1 protease
(Human immunodeficiency virus type 1)
BDBM50285977
(CHEMBL99214 | [(1R,2R)-3-((3aR,6S,7aS)-6-tert-Buty...)
Show SMILES C[C@@H]1[C@@H](CCS1(=O)=O)OC(=O)N[C@@H](CSc1ccccc1)[C@H](O)CN1C[C@H]2CCS[C@H]2C[C@H]1C(=O)NC(C)(C)C
Show InChI InChI=1S/C28H43N3O6S3/c1-18-24(11-13-40(18,35)36)37-27(34)29-21(17-39-20-8-6-5-7-9-20)23(32)16-31-15-19-10-12-38-25(19)14-22(31)26(33)30-28(2,3)4/h5-9,18-19,21-25,32H,10-17H2,1-4H3,(H,29,34)(H,30,33)/t18-,19-,21+,22+,23-,24-,25+/m1/s1
n/an/a 0.75n/an/an/an/an/an/a
Lilly Research Laboratories
Assay Description
In vitro inhibition of HIV-1 protease.
Bioorg Med Chem Lett 5: 2891-6 (1995)
Article DOI: 10.1016/0960-894X(95)00507-P
BindingDB Entry DOI: 10.7270/Q2T43R7T