BDBM50286171 1-[(R)-1-(4-Benzoyl-piperidine-1-carbonyl)-4-oxo-4-pyrrolidin-1-yl-butyl]-3-m-tolyl-urea::CHEMBL420658
SMILES: Cc1cccc(NC(=O)N[C@H](CCC(=O)N2CCCC2)C(=O)N2CCC(CC2)C(=O)c2ccccc2)c1
InChI Key: InChIKey=HRFMJPIGMOWHLL-RUZDIDTESA-N
Data: 2 IC50
Activity Spreadsheet -- Enzyme Inhibition Constant Data from BindingDB
Found 2 hits for monomerid = 50286171
Trg + Lig
Ki
nM
ΔG°
kcal/mole
IC50
nM
Kd
nM
EC50/IC50
nM
koff
s-1
kon
M-1s-1
pHTemp
°C
Cholecystokinin receptor
(Homo sapiens (Human))
BDBM50286171
(1-[(R)-1-(4-Benzoyl-piperidine-1-carbonyl)-4-oxo-4...)
Show SMILES Cc1cccc(NC(=O)N[C@H](CCC(=O)N2CCCC2)C(=O)N2CCC(CC2)C(=O)c2ccccc2)c1
Show InChI InChI=1S/C29H36N4O4/c1-21-8-7-11-24(20-21)30-29(37)31-25(12-13-26(34)32-16-5-6-17-32)28(36)33-18-14-23(15-19-33)27(35)22-9-3-2-4-10-22/h2-4,7-11,20,23,25H,5-6,12-19H2,1H3,(H2,30,31,37)/t25-/m1/s1
Reactome pathway
n/an/a 53n/an/an/an/an/an/a
TBA
Curated by ChEMBL
Assay Description
Inhibitory activity towards binding of [125I]-Bolton-Hunter-CCK-8 to CCKB receptor in guinea pig cortical tissue
Bioorg Med Chem Lett 5: 3057-3062 (1995)
Article DOI: 10.1016/0960-894X(95)00537-3
BindingDB Entry DOI: 10.7270/Q2BZ6604
Cholecystokinin A receptor
(Cavia porcellus)
BDBM50286171
(1-[(R)-1-(4-Benzoyl-piperidine-1-carbonyl)-4-oxo-4...)
Show SMILES Cc1cccc(NC(=O)N[C@H](CCC(=O)N2CCCC2)C(=O)N2CCC(CC2)C(=O)c2ccccc2)c1
Show InChI InChI=1S/C29H36N4O4/c1-21-8-7-11-24(20-21)30-29(37)31-25(12-13-26(34)32-16-5-6-17-32)28(36)33-18-14-23(15-19-33)27(35)22-9-3-2-4-10-22/h2-4,7-11,20,23,25H,5-6,12-19H2,1H3,(H2,30,31,37)/t25-/m1/s1
Reactome pathway
n/an/a 1.90E+3n/an/an/an/an/an/a
TBA
Curated by ChEMBL
Assay Description
Inhibitory activity towards binding of [125I]-Bolton-Hunter-CCK-8 to CCKA receptor in guinea pig pancreatic tissue
Bioorg Med Chem Lett 5: 3057-3062 (1995)
Article DOI: 10.1016/0960-894X(95)00537-3
BindingDB Entry DOI: 10.7270/Q2BZ6604