BDBM50286174 CHEMBL320886::[(S)-1-[(S)-1-(4-Benzoyl-piperidine-1-carbonyl)-3-methyl-butylcarbamoyl]-2-(1H-indol-3-yl)-ethyl]-carbamic acid tert-butyl ester
SMILES: CC(C)C[C@H](NC(=O)[C@H](Cc1c[nH]c2ccccc12)NC(=O)OC(C)(C)C)C(=O)N1CCC(CC1)C(=O)c1ccccc1
InChI Key: InChIKey=ZOZPVKJSFYNWLP-VMPREFPWSA-N
Data: 2 IC50
Activity Spreadsheet -- Enzyme Inhibition Constant Data from BindingDB
Found 2 hits for monomerid = 50286174
Trg + Lig
Ki
nM
ΔG°
kcal/mole
IC50
nM
Kd
nM
EC50/IC50
nM
koff
s-1
kon
M-1s-1
pHTemp
°C
Cholecystokinin receptor
(Homo sapiens (Human))
BDBM50286174
(CHEMBL320886 | [(S)-1-[(S)-1-(4-Benzoyl-piperidine...)
Show SMILES CC(C)C[C@H](NC(=O)[C@H](Cc1c[nH]c2ccccc12)NC(=O)OC(C)(C)C)C(=O)N1CCC(CC1)C(=O)c1ccccc1
Show InChI InChI=1S/C34H44N4O5/c1-22(2)19-29(32(41)38-17-15-24(16-18-38)30(39)23-11-7-6-8-12-23)36-31(40)28(37-33(42)43-34(3,4)5)20-25-21-35-27-14-10-9-13-26(25)27/h6-14,21-22,24,28-29,35H,15-20H2,1-5H3,(H,36,40)(H,37,42)/t28-,29-/m0/s1
Reactome pathway
n/an/a 912n/an/an/an/an/an/a
TBA
Curated by ChEMBL
Assay Description
Inhibitory activity towards binding of [125I]-Bolton-Hunter-CCK-8 to CCKB receptor in guinea pig cortical tissue
Bioorg Med Chem Lett 5: 3057-3062 (1995)
Article DOI: 10.1016/0960-894X(95)00537-3
BindingDB Entry DOI: 10.7270/Q2BZ6604
Cholecystokinin A receptor
(Cavia porcellus)
BDBM50286174
(CHEMBL320886 | [(S)-1-[(S)-1-(4-Benzoyl-piperidine...)
Show SMILES CC(C)C[C@H](NC(=O)[C@H](Cc1c[nH]c2ccccc12)NC(=O)OC(C)(C)C)C(=O)N1CCC(CC1)C(=O)c1ccccc1
Show InChI InChI=1S/C34H44N4O5/c1-22(2)19-29(32(41)38-17-15-24(16-18-38)30(39)23-11-7-6-8-12-23)36-31(40)28(37-33(42)43-34(3,4)5)20-25-21-35-27-14-10-9-13-26(25)27/h6-14,21-22,24,28-29,35H,15-20H2,1-5H3,(H,36,40)(H,37,42)/t28-,29-/m0/s1
Reactome pathway
n/an/a 640n/an/an/an/an/an/a
TBA
Curated by ChEMBL
Assay Description
Inhibitory activity towards binding of [125I]-Bolton-Hunter-CCK-8 to CCKA receptor in guinea pig pancreatic tissue
Bioorg Med Chem Lett 5: 3057-3062 (1995)
Article DOI: 10.1016/0960-894X(95)00537-3
BindingDB Entry DOI: 10.7270/Q2BZ6604