BDBM50286433 1-(2-Fluoro-4-hydroxy-phenyl)-4-oxo-7-pyridin-4-yl-1,4-dihydro-quinoline-3-carboxylic acid amide::CHEMBL340238
SMILES: NC(=O)c1cn(-c2ccc(O)cc2F)c2cc(ccc2c1=O)-c1ccncc1
InChI Key: InChIKey=RWDAGSGQOVTILW-UHFFFAOYSA-N
Data: 1 IC50
Activity Spreadsheet -- Enzyme Inhibition Constant Data from BindingDB
Found 1 hit for monomerid = 50286433
Trg + Lig
Ki
nM
ΔG°
kcal/mole
IC50
nM
Kd
nM
EC50/IC50
nM
koff
s-1
kon
M-1s-1
pHTemp
°C
Calpain1
(Homo sapiens (Human))
BDBM50286433
(1-(2-Fluoro-4-hydroxy-phenyl)-4-oxo-7-pyridin-4-yl...)
Show SMILES NC(=O)c1cn(-c2ccc(O)cc2F)c2cc(ccc2c1=O)-c1ccncc1
Show InChI InChI=1S/C21H14FN3O3/c22-17-10-14(26)2-4-18(17)25-11-16(21(23)28)20(27)15-3-1-13(9-19(15)25)12-5-7-24-8-6-12/h1-11,26H,(H2,23,28)
Reactome pathway
n/an/a 7.00E+3n/an/an/an/an/an/a
TBA
Curated by ChEMBL
Assay Description
In vitro inhibitory activity against human erythrocyte Calpain 1
Bioorg Med Chem Lett 5: 387-392 (1995)
Article DOI: 10.1016/0960-894X(95)00041-Q
BindingDB Entry DOI: 10.7270/Q21G0M6W