BDBM50286451 CHEMBL129823::[1-((S)-1-Benzyl-2-oxo-ethylcarbamoyl)-2,2-dimethyl-propyl]-carbamic acid benzyl ester
SMILES: CC(C)(C)C(NC(=O)OCc1ccccc1)C(=O)N[C@@H](Cc1ccccc1)C=O
InChI Key: InChIKey=BOLCGBQAKSTBLH-XJDOXCRVSA-N
Data: 1 IC50
Activity Spreadsheet -- Enzyme Inhibition Constant Data from BindingDB
Found 1 hit for monomerid = 50286451
Trg + Lig
Ki
nM
ΔG°
kcal/mole
IC50
nM
Kd
nM
EC50/IC50
nM
koff
s-1
kon
M-1s-1
pHTemp
°C
Calpain 1/small subunit 1
(Homo sapiens (Human))
BDBM50286451
(CHEMBL129823 | [1-((S)-1-Benzyl-2-oxo-ethylcarbamo...)
Show SMILES CC(C)(C)C(NC(=O)OCc1ccccc1)C(=O)N[C@@H](Cc1ccccc1)C=O
Show InChI InChI=1S/C23H28N2O4/c1-23(2,3)20(25-22(28)29-16-18-12-8-5-9-13-18)21(27)24-19(15-26)14-17-10-6-4-7-11-17/h4-13,15,19-20H,14,16H2,1-3H3,(H,24,27)(H,25,28)/t19-,20?/m0/s1
Reactome pathway
n/an/a 500n/an/an/an/an/an/a
TBA
Curated by ChEMBL
Assay Description
Inhibition of Calpain 1 by [3H]-acetyl-casein assay
Bioorg Med Chem Lett 5: 393-398 (1995)
Article DOI: 10.1016/0960-894X(95)00042-R
BindingDB Entry DOI: 10.7270/Q2WQ03R1