BDBM50287156 2-Benzyl-1H-indole-5-carboxamidine::CHEMBL287401
SMILES: NC(=N)c1ccc2[nH]c(Cc3ccccc3)cc2c1
InChI Key: InChIKey=RSJJRSWDMOGILH-UHFFFAOYSA-N
Data: 1 KI  1 IC50
Activity Spreadsheet -- Enzyme Inhibition Constant Data from BindingDB
Found 2 hits for monomerid = 50287156
Trg + Lig
Ki
nM
ΔG°
kcal/mole
IC50
nM
Kd
nM
EC50/IC50
nM
koff
s-1
kon
M-1s-1
pHTemp
°C
Prothrombin
(Homo sapiens (Human))
BDBM50287156
(2-Benzyl-1H-indole-5-carboxamidine | CHEMBL287401)
Show SMILES NC(=N)c1ccc2[nH]c(Cc3ccccc3)cc2c1
Show InChI InChI=1S/C16H15N3/c17-16(18)12-6-7-15-13(9-12)10-14(19-15)8-11-4-2-1-3-5-11/h1-7,9-10,19H,8H2,(H3,17,18)
260n/an/an/an/an/an/an/an/a
TBA
Curated by ChEMBL
Assay Description
Compound was evaluated for inhibition of human alpha-thrombin catalytic activity
Bioorg Med Chem Lett 6: 1339-1344 (1996)
Article DOI: 10.1016/0960-894X(96)00229-6
BindingDB Entry DOI: 10.7270/Q2TM7B2Z
Prothrombin
(Homo sapiens (Human))
BDBM50287156
(2-Benzyl-1H-indole-5-carboxamidine | CHEMBL287401)
Show SMILES NC(=N)c1ccc2[nH]c(Cc3ccccc3)cc2c1
Show InChI InChI=1S/C16H15N3/c17-16(18)12-6-7-15-13(9-12)10-14(19-15)8-11-4-2-1-3-5-11/h1-7,9-10,19H,8H2,(H3,17,18)
n/an/a 1.40E+3n/an/an/an/an/an/a
TBA
Curated by ChEMBL
Assay Description
Compound was evaluated for inhibition of human alpha-thrombin catalytic activity.
Bioorg Med Chem Lett 6: 1339-1344 (1996)
Article DOI: 10.1016/0960-894X(96)00229-6
BindingDB Entry DOI: 10.7270/Q2TM7B2Z