BDBM50287157 6,7,8,9-Tetrahydro-5H-carbazole-3-carboxamidine::CHEMBL281719
SMILES: NC(=N)c1ccc2[nH]c3CCCCc3c2c1
InChI Key: InChIKey=VYBXXCVSGLRMGC-UHFFFAOYSA-N
Data: 1 IC50
Activity Spreadsheet -- Enzyme Inhibition Constant Data from BindingDB
Found 1 hit for monomerid = 50287157
Trg + Lig
Ki
nM
ΔG°
kcal/mole
IC50
nM
Kd
nM
EC50/IC50
nM
koff
s-1
kon
M-1s-1
pHTemp
°C
Prothrombin
(Homo sapiens (Human))
BDBM50287157
(6,7,8,9-Tetrahydro-5H-carbazole-3-carboxamidine | ...)
Show SMILES NC(=N)c1ccc2[nH]c3CCCCc3c2c1
Show InChI InChI=1S/C13H15N3/c14-13(15)8-5-6-12-10(7-8)9-3-1-2-4-11(9)16-12/h5-7,16H,1-4H2,(H3,14,15)
n/an/a 2.00E+4n/an/an/an/an/an/a
TBA
Curated by ChEMBL
Assay Description
Compound was evaluated for inhibition of human alpha-thrombin catalytic activity.
Bioorg Med Chem Lett 6: 1339-1344 (1996)
Article DOI: 10.1016/0960-894X(96)00229-6
BindingDB Entry DOI: 10.7270/Q2TM7B2Z