BDBM50287159 2-(3-Phenoxy-benzyl)-1H-indole-5-carboxamidine::CHEMBL27805
SMILES: NC(=N)c1ccc2[nH]c(Cc3cccc(Oc4ccccc4)c3)cc2c1
InChI Key: InChIKey=HICLOEGENKPBRC-UHFFFAOYSA-N
Data: 1 IC50
Activity Spreadsheet -- Enzyme Inhibition Constant Data from BindingDB
Found 1 hit for monomerid = 50287159
Trg + Lig
Ki
nM
ΔG°
kcal/mole
IC50
nM
Kd
nM
EC50/IC50
nM
koff
s-1
kon
M-1s-1
pHTemp
°C
Prothrombin
(Homo sapiens (Human))
BDBM50287159
(2-(3-Phenoxy-benzyl)-1H-indole-5-carboxamidine | C...)
Show SMILES NC(=N)c1ccc2[nH]c(Cc3cccc(Oc4ccccc4)c3)cc2c1
Show InChI InChI=1S/C22H19N3O/c23-22(24)16-9-10-21-17(13-16)14-18(25-21)11-15-5-4-8-20(12-15)26-19-6-2-1-3-7-19/h1-10,12-14,25H,11H2,(H3,23,24)
n/an/a 2.00E+3n/an/an/an/an/an/a
TBA
Curated by ChEMBL
Assay Description
Compound was evaluated for inhibition of human alpha-thrombin catalytic activity.
Bioorg Med Chem Lett 6: 1339-1344 (1996)
Article DOI: 10.1016/0960-894X(96)00229-6
BindingDB Entry DOI: 10.7270/Q2TM7B2Z