BDBM50287710 (2S)-1-({[(phosphonatooxy)phosphinato]oxy}acetyl)pyrrolidine-2-carboxylate
SMILES: [O-]C(=O)[C@@H]1CCCN1C(=O)COP([O-])(=O)OP([O-])([O-])=O
InChI Key: InChIKey=JFTJDUMMWOSHFL-YFKPBYRVSA-J
Data: 1 IC50
Activity Spreadsheet -- Enzyme Inhibition Constant Data from BindingDB
Found 1 hit for monomerid = 50287710
Trg + Lig
Ki
nM
ΔG°
kcal/mole
IC50
nM
Kd
nM
EC50/IC50
nM
koff
s-1
kon
M-1s-1
pHTemp
°C
Mevalonate pyrophosphate decarboxylase
(Homo sapiens (Human))
BDBM50287710
((2S)-1-({[(phosphonatooxy)phosphinato]oxy}acetyl)p...)
Show SMILES [O-]C(=O)[C@@H]1CCCN1C(=O)COP([O-])(=O)OP([O-])([O-])=O
Show InChI InChI=1S/C7H13NO10P2/c9-6(8-3-1-2-5(8)7(10)11)4-17-20(15,16)18-19(12,13)14/h5H,1-4H2,(H,10,11)(H,15,16)(H2,12,13,14)/p-4/t5-/m0/s1
Reactome pathway
n/an/a 9n/an/an/an/an/an/a
TBA
Curated by ChEMBL
Assay Description
Compound was evaluated for its inhibitory activity against Mevalonate 5-pyrophosphate decarboxylase
Bioorg Med Chem Lett 6: 2091-2096 (1996)
Article DOI: 10.1016/0960-894X(96)00374-5
BindingDB Entry DOI: 10.7270/Q2930TPB