BDBM50288868 5-Guanidino-2-(2-{2-[2-(4-sulfamoyl-benzoylamino)-acetylamino]-acetylamino}-acetylamino)-pentanoic acid::CHEMBL2371097
SMILES: NC(=N)NCCC[C@H](NC(=O)CNC(=O)CNC(=O)c1ccc(cc1)S(N)(=O)=O)C(O)=O
InChI Key: InChIKey=TUJWMXQEISUVJO-LBPRGKRZSA-N
Data: 1 Kd
Activity Spreadsheet -- Enzyme Inhibition Constant Data from BindingDB
Found 1 hit for monomerid = 50288868
Trg + Lig
Ki
nM
ΔG°
kcal/mole
IC50
nM
Kd
nM
EC50/IC50
nM
koff
s-1
kon
M-1s-1
pHTemp
°C
Carbonic anhydrase 2
(Homo sapiens (Human))
BDBM50288868
(5-Guanidino-2-(2-{2-[2-(4-sulfamoyl-benzoylamino)-...)
Show SMILES NC(=N)NCCC[C@H](NC(=O)CNC(=O)CNC(=O)c1ccc(cc1)S(N)(=O)=O)C(O)=O |r|
Show InChI InChI=1S/C17H25N7O7S/c18-17(19)21-7-1-2-12(16(28)29)24-14(26)9-22-13(25)8-23-15(27)10-3-5-11(6-4-10)32(20,30)31/h3-6,12H,1-2,7-9H2,(H,22,25)(H,23,27)(H,24,26)(H,28,29)(H4,18,19,21)(H2,20,30,31)/t12-/m0/s1
Reactome pathway
n/an/an/a 300n/an/an/an/an/a
TBA
Curated by ChEMBL
Assay Description
Dissociation constant against human carbonic anhydrase II at 37 degree centigrade
Bioorg Med Chem Lett 6: 559-564 (1996)
Article DOI: 10.1016/0960-894X(96)00069-8
BindingDB Entry DOI: 10.7270/Q2V124SF