BDBM50288869 2-(2-{2-[2-(4-Sulfamoyl-benzoylamino)-acetylamino]-acetylamino}-acetylamino)-pentanedioic acid::CHEMBL2371110
SMILES: NS(=O)(=O)c1ccc(cc1)C(=O)NCC(=O)NCC(=O)NCC(=O)N[C@@H](CCC(O)=O)C(O)=O
InChI Key: InChIKey=PQMDXUZJGHYQCV-LBPRGKRZSA-N
Data: 1 Kd
Activity Spreadsheet -- Enzyme Inhibition Constant Data from BindingDB
Found 1 hit for monomerid = 50288869
Trg + Lig
Ki
nM
ΔG°
kcal/mole
IC50
nM
Kd
nM
EC50/IC50
nM
koff
s-1
kon
M-1s-1
pHTemp
°C
Carbonic anhydrase 2
(Homo sapiens (Human))
BDBM50288869
(2-(2-{2-[2-(4-Sulfamoyl-benzoylamino)-acetylamino]...)
Show SMILES NS(=O)(=O)c1ccc(cc1)C(=O)NCC(=O)NCC(=O)NCC(=O)N[C@@H](CCC(O)=O)C(O)=O |r|
Show InChI InChI=1S/C18H23N5O10S/c19-34(32,33)11-3-1-10(2-4-11)17(29)22-8-14(25)20-7-13(24)21-9-15(26)23-12(18(30)31)5-6-16(27)28/h1-4,12H,5-9H2,(H,20,25)(H,21,24)(H,22,29)(H,23,26)(H,27,28)(H,30,31)(H2,19,32,33)/t12-/m0/s1
Reactome pathway
n/an/an/a 371n/an/an/an/an/a
TBA
Curated by ChEMBL
Assay Description
Dissociation constant against human carbonic anhydrase II at 37 degree centigrade
Bioorg Med Chem Lett 6: 559-564 (1996)
Article DOI: 10.1016/0960-894X(96)00069-8
BindingDB Entry DOI: 10.7270/Q2V124SF