BDBM50288877 2-{2-[2-(4-Sulfamoyl-benzoylamino)-acetylamino]-acetylamino}-hexanoic acid::CHEMBL2371066
SMILES: CCCC[C@H](NC(=O)CNC(=O)CNC(=O)c1ccc(cc1)S(N)(=O)=O)C(O)=O
InChI Key: InChIKey=DQYUKJWLDWVZHA-ZDUSSCGKSA-N
Data: 1 Kd
Activity Spreadsheet -- Enzyme Inhibition Constant Data from BindingDB
Found 1 hit for monomerid = 50288877
Trg + Lig
Ki
nM
ΔG°
kcal/mole
IC50
nM
Kd
nM
EC50/IC50
nM
koff
s-1
kon
M-1s-1
pHTemp
°C
Carbonic anhydrase 2
(Homo sapiens (Human))
BDBM50288877
(2-{2-[2-(4-Sulfamoyl-benzoylamino)-acetylamino]-ac...)
Show SMILES CCCC[C@H](NC(=O)CNC(=O)CNC(=O)c1ccc(cc1)S(N)(=O)=O)C(O)=O |r|
Show InChI InChI=1S/C17H24N4O7S/c1-2-3-4-13(17(25)26)21-15(23)10-19-14(22)9-20-16(24)11-5-7-12(8-6-11)29(18,27)28/h5-8,13H,2-4,9-10H2,1H3,(H,19,22)(H,20,24)(H,21,23)(H,25,26)(H2,18,27,28)/t13-/m0/s1
Reactome pathway
n/an/an/a 140n/an/an/an/an/a
TBA
Curated by ChEMBL
Assay Description
Dissociation constant against human carbonic anhydrase II at 37 degree centigrade
Bioorg Med Chem Lett 6: 559-564 (1996)
Article DOI: 10.1016/0960-894X(96)00069-8
BindingDB Entry DOI: 10.7270/Q2V124SF