BDBM50288897 1-[2-(4-Sulfamoyl-benzoylamino)-acetyl]-pyrrolidine-2-carboxylic acid::CHEMBL155157
SMILES: NS(=O)(=O)c1ccc(cc1)C(=O)NCC(=O)N1CCCC1C(O)=O
InChI Key: InChIKey=NYILPDOPQMCAST-UHFFFAOYSA-N
Data: 1 Kd
Activity Spreadsheet -- Enzyme Inhibition Constant Data from BindingDB
Found 1 hit for monomerid = 50288897
Trg + Lig
Ki
nM
ΔG°
kcal/mole
IC50
nM
Kd
nM
EC50/IC50
nM
koff
s-1
kon
M-1s-1
pHTemp
°C
Carbonic anhydrase 2
(Homo sapiens (Human))
BDBM50288897
(1-[2-(4-Sulfamoyl-benzoylamino)-acetyl]-pyrrolidin...)
Show SMILES NS(=O)(=O)c1ccc(cc1)C(=O)NCC(=O)N1CCCC1C(O)=O
Show InChI InChI=1S/C14H17N3O6S/c15-24(22,23)10-5-3-9(4-6-10)13(19)16-8-12(18)17-7-1-2-11(17)14(20)21/h3-6,11H,1-2,7-8H2,(H,16,19)(H,20,21)(H2,15,22,23)
Reactome pathway
n/an/an/a 250n/an/an/an/an/a
TBA
Curated by ChEMBL
Assay Description
Dissociation constant against human carbonic anhydrase II at 37 degree centigrade
Bioorg Med Chem Lett 6: 559-564 (1996)
Article DOI: 10.1016/0960-894X(96)00069-8
BindingDB Entry DOI: 10.7270/Q2V124SF