BDBM50288998 6,7-Dichloro-2-(2-iodo-phenyl)-benzo[d][1,3]oxazin-4-one::CHEMBL157862
SMILES: Clc1cc2nc(oc(=O)c2cc1Cl)-c1ccccc1I
InChI Key: InChIKey=DMIGLZQAGVEUTI-UHFFFAOYSA-N
Data: 3 IC50
Activity Spreadsheet -- Enzyme Inhibition Constant Data from BindingDB
Found 3 hits for monomerid = 50288998
Trg + Lig
Ki
nM
ΔG°
kcal/mole
IC50
nM
Kd
nM
EC50/IC50
nM
koff
s-1
kon
M-1s-1
pHTemp
°C
Complement C1r subcomponent
(Homo sapiens (Human))
BDBM50288998
(6,7-Dichloro-2-(2-iodo-phenyl)-benzo[d][1,3]oxazin...)
Show SMILES Clc1cc2nc(oc(=O)c2cc1Cl)-c1ccccc1I
Show InChI InChI=1S/C14H6Cl2INO2/c15-9-5-8-12(6-10(9)16)18-13(20-14(8)19)7-3-1-2-4-11(7)17/h1-6H
Reactome pathway
n/an/a>6.25E+4n/an/an/an/an/an/a
TBA
Curated by ChEMBL
Assay Description
Inhibitory activity against C1r serine protease
Bioorg Med Chem Lett 6: 679-682 (1996)
Article DOI: 10.1016/0960-894X(96)00094-7
BindingDB Entry DOI: 10.7270/Q2P84BVF
Complement C1r
(Homo sapiens (Human))
BDBM50288998
(6,7-Dichloro-2-(2-iodo-phenyl)-benzo[d][1,3]oxazin...)
Show SMILES Clc1cc2nc(oc(=O)c2cc1Cl)-c1ccccc1I
Show InChI InChI=1S/C14H6Cl2INO2/c15-9-5-8-12(6-10(9)16)18-13(20-14(8)19)7-3-1-2-4-11(7)17/h1-6H
Reactome pathway
n/an/a 1.70E+3n/an/an/an/an/an/a
TBA
Curated by ChEMBL
Assay Description
Inhibitory activity against C1r serine protease
Bioorg Med Chem Lett 6: 679-682 (1996)
Article DOI: 10.1016/0960-894X(96)00094-7
BindingDB Entry DOI: 10.7270/Q2P84BVF
Complement C1r
(Homo sapiens (Human))
BDBM50288998
(6,7-Dichloro-2-(2-iodo-phenyl)-benzo[d][1,3]oxazin...)
Show SMILES Clc1cc2nc(oc(=O)c2cc1Cl)-c1ccccc1I
Show InChI InChI=1S/C14H6Cl2INO2/c15-9-5-8-12(6-10(9)16)18-13(20-14(8)19)7-3-1-2-4-11(7)17/h1-6H
Reactome pathway
n/an/a>6.25E+4n/an/an/an/an/an/a
TBA
Curated by ChEMBL
Assay Description
Inhibition of C1r serine protease
Bioorg Med Chem Lett 6: 679-682 (1996)
Article DOI: 10.1016/0960-894X(96)00094-7
BindingDB Entry DOI: 10.7270/Q2P84BVF