BDBM50289725 CHEMBL301306::Isoquinoline-3-carboxylic acid [(S)-1-((1S,2S,4S)-1-cyclohexylmethyl-2,4-dihydroxy-5-methyl-hexylcarbamoyl)-2-(1H-imidazol-4-yl)-ethyl]-amide
SMILES: CC(C)[C@@H](O)C[C@H](O)[C@H](CC1CCCCC1)NC(=O)[C@H](Cc1cnc[nH]1)NC(=O)c1cc2ccccc2cn1
InChI Key: InChIKey=OIAJUAFTHLOOTI-VNNZRSTGSA-N
Data: 1 IC50
Activity Spreadsheet -- Enzyme Inhibition Constant Data from BindingDB
Found 1 hit for monomerid = 50289725
Trg + Lig
Ki
nM
ΔG°
kcal/mole
IC50
nM
Kd
nM
EC50/IC50
nM
koff
s-1
kon
M-1s-1
pHTemp
°C
Renin
(Homo sapiens (Human))
BDBM50289725
(CHEMBL301306 | Isoquinoline-3-carboxylic acid [(S)...)
Show SMILES CC(C)[C@@H](O)C[C@H](O)[C@H](CC1CCCCC1)NC(=O)[C@H](Cc1cnc[nH]1)NC(=O)c1cc2ccccc2cn1
Show InChI InChI=1S/C30H41N5O4/c1-19(2)27(36)15-28(37)24(12-20-8-4-3-5-9-20)34-30(39)26(14-23-17-31-18-33-23)35-29(38)25-13-21-10-6-7-11-22(21)16-32-25/h6-7,10-11,13,16-20,24,26-28,36-37H,3-5,8-9,12,14-15H2,1-2H3,(H,31,33)(H,34,39)(H,35,38)/t24-,26-,27-,28-/m0/s1
Reactome pathway
n/an/a 790n/an/an/an/an/an/a
TBA
Curated by ChEMBL
Assay Description
In vitro renin inhibitory effect was evaluated for plasma renin activity (PRA) of human plasma, Expressed as IC50
Bioorg Med Chem Lett 7: 1863-1868 (1997)
Article DOI: 10.1016/S0960-894X(97)00323-5
BindingDB Entry DOI: 10.7270/Q2K64J20