null
SMILES: OC(c1ccn(c1)S(=O)(=O)c1ccccc1)c1ccccc1Cl
InChI Key: InChIKey=OANRILCKDVANPL-UHFFFAOYSA-N
Activity Spreadsheet -- Enzyme Inhibition Constant Data from BindingDB
Found 1 hit for monomerid = 50289787
Trg + Lig
Ki
nM
ΔG°
kcal/mole
IC50
nM
Kd
nM
EC50/IC50
nM
koff
s-1
kon
M-1s-1
pHTemp
°C
Reverse transcriptase/RNaseH
(Human immunodeficiency virus 1)
BDBM50289787
((1-Benzenesulfonyl-1H-pyrrol-3-yl)-(2-chloro-pheny...)
Show SMILES OC(c1ccn(c1)S(=O)(=O)c1ccccc1)c1ccccc1Cl
Show InChI InChI=1S/C17H14ClNO3S/c18-16-9-5-4-8-15(16)17(20)13-10-11-19(12-13)23(21,22)14-6-2-1-3-7-14/h1-12,17,20H
n/an/a 2.95E+4n/an/an/an/an/an/a
TBA
Curated by ChEMBL
Assay Description
Inhibition of HIV-1 recombinant reverse transcriptase
Bioorg Med Chem Lett 7: 1931-1936 (1997)
Article DOI: 10.1016/S0960-894X(97)00340-5
BindingDB Entry DOI: 10.7270/Q2NZ87M5