BDBM50290088 (2S,3R)-N*1*-((R)-2,2-Dimethyl-1-methylcarbamoyl-propyl)-N*4*-hydroxy-2-isobutyl-3-(3,4,4-trimethyl-2,5-dioxo-imidazolidin-1-ylmethyl)-succinamide::CHEMBL73763
SMILES: CNC(=O)[C@H](NC(=O)[C@H](CC(C)C)[C@@H](CN1C(=O)N(C)C(C)(C)C1=O)C(=O)NO)C(C)(C)C
InChI Key: InChIKey=OLEYZXUQGOKVKT-KFWWJZLASA-N
Data: 2 IC50
Activity Spreadsheet -- Enzyme Inhibition Constant Data from BindingDB
Found 2 hits for monomerid = 50290088
Trg + Lig
Ki
nM
ΔG°
kcal/mole
IC50
nM
Kd
nM
EC50/IC50
nM
koff
s-1
kon
M-1s-1
pHTemp
°C
Collagenase
(Homo sapiens (Human))
BDBM50290088
((2S,3R)-N*1*-((R)-2,2-Dimethyl-1-methylcarbamoyl-p...)
Show SMILES CNC(=O)[C@H](NC(=O)[C@H](CC(C)C)[C@@H](CN1C(=O)N(C)C(C)(C)C1=O)C(=O)NO)C(C)(C)C
Show InChI InChI=1S/C22H39N5O6/c1-12(2)10-13(16(28)24-15(18(30)23-8)21(3,4)5)14(17(29)25-33)11-27-19(31)22(6,7)26(9)20(27)32/h12-15,33H,10-11H2,1-9H3,(H,23,30)(H,24,28)(H,25,29)/t13-,14-,15+/m1/s1
n/an/a 1n/an/an/an/an/an/a
TBA
Curated by ChEMBL
Assay Description
Evaluation for functional inhibitory potency prevention of ET-1 induced constriction of rat aortic rings (ETA receptors)
Bioorg Med Chem Lett 7: 2299-2302 (1997)
Article DOI: 10.1016/S0960-894X(97)00416-2
BindingDB Entry DOI: 10.7270/Q26T0MM8
Matrix metalloproteinase-9
(Homo sapiens (Human))
BDBM50290088
((2S,3R)-N*1*-((R)-2,2-Dimethyl-1-methylcarbamoyl-p...)
Show SMILES CNC(=O)[C@H](NC(=O)[C@H](CC(C)C)[C@@H](CN1C(=O)N(C)C(C)(C)C1=O)C(=O)NO)C(C)(C)C
Show InChI InChI=1S/C22H39N5O6/c1-12(2)10-13(16(28)24-15(18(30)23-8)21(3,4)5)14(17(29)25-33)11-27-19(31)22(6,7)26(9)20(27)32/h12-15,33H,10-11H2,1-9H3,(H,23,30)(H,24,28)(H,25,29)/t13-,14-,15+/m1/s1
Reactome pathway
n/an/a 2.80n/an/an/an/an/an/a
TBA
Curated by ChEMBL
Assay Description
Inhibition of human gelatinase B, MMP9
Bioorg Med Chem Lett 7: 2299-2302 (1997)
Article DOI: 10.1016/S0960-894X(97)00416-2
BindingDB Entry DOI: 10.7270/Q26T0MM8