null
SMILES: CCCCCCCC(=O)N(C)CCOc1ccc(Cc2sc(=O)[nH]c2O)cc1
InChI Key: InChIKey=BSBJNMJTLTWXEB-UHFFFAOYSA-N
Activity Spreadsheet -- Enzyme Inhibition Constant Data from BindingDB
Found 1 hit for monomerid = 50290275
Trg + Lig
Ki
nM
ΔG°
kcal/mole
IC50
nM
Kd
nM
EC50/IC50
nM
koff
s-1
kon
M-1s-1
pHTemp
°C
Peroxisome proliferator-activated receptor gamma
(Homo sapiens (Human))
BDBM50290275
(CHEMBL83875 | Octanoic acid {2-[4-(2,4-dioxo-thiaz...)
Show SMILES CCCCCCCC(=O)N(C)CCOc1ccc(Cc2sc(=O)[nH]c2O)cc1
Show InChI InChI=1S/C21H30N2O4S/c1-3-4-5-6-7-8-19(24)23(2)13-14-27-17-11-9-16(10-12-17)15-18-20(25)22-21(26)28-18/h9-12,25H,3-8,13-15H2,1-2H3,(H,22,26)
NCI pathway
Reactome pathway
48n/an/an/an/an/an/an/an/a
TBA
Curated by ChEMBL
Assay Description
Binding affinity was determined by displacement of 20 nM [3H]- thiazolidinedione from 4 nM biotinylated human peroxisome proliferator-activated recep...
Bioorg Med Chem Lett 7: 2491-2496 (1997)
Article DOI: 10.1016/S0960-894X(97)10017-8
BindingDB Entry DOI: 10.7270/Q2DB81VF