BDBM50290338 1-(4-Fluoro-phenyl)-7-(3-methoxy-benzyl)-octahydro-indazole-3-carbaldehyde::CHEMBL314475
SMILES: COc1cccc(CC2CCCC3C(NN(C23)c2ccc(F)cc2)C=O)c1
InChI Key: InChIKey=YDFYVNXCXLADDA-UHFFFAOYSA-N
Data: 1 IC50
Activity Spreadsheet -- Enzyme Inhibition Constant Data from BindingDB
Found 1 hit for monomerid = 50290338
Trg + Lig
Ki
nM
ΔG°
kcal/mole
IC50
nM
Kd
nM
EC50/IC50
nM
koff
s-1
kon
M-1s-1
pHTemp
°C
Progesterone receptor
(Oryctolagus cuniculus)
BDBM50290338
(1-(4-Fluoro-phenyl)-7-(3-methoxy-benzyl)-octahydro...)
Show SMILES COc1cccc(CC2CCCC3C(NN(C23)c2ccc(F)cc2)C=O)c1
Show InChI InChI=1S/C22H25FN2O2/c1-27-19-6-2-4-15(13-19)12-16-5-3-7-20-21(14-26)24-25(22(16)20)18-10-8-17(23)9-11-18/h2,4,6,8-11,13-14,16,20-22,24H,3,5,7,12H2,1H3
n/an/a 17n/an/an/an/an/an/a
TBA
Curated by ChEMBL
Assay Description
Binding affinity determined by ability to displace [3H]-R5020 radioligand using uterine progesterone receptor obtained from estrogen-primed rabbit
Bioorg Med Chem Lett 7: 2551-2556 (1997)
Article DOI: 10.1016/S0960-894X(97)10016-6
BindingDB Entry DOI: 10.7270/Q2MW2H5C