BDBM50290376 1-(4-Fluoro-phenyl)-7-(4-methoxy-benzyl)-4,5,6,7-tetrahydro-1H-indazole-3-carbaldehyde::CHEMBL85760
SMILES: COc1ccc(CC2CCCc3c(C=O)nn(c23)-c2ccc(F)cc2)cc1
InChI Key: InChIKey=FRJPJBMILQXBLD-UHFFFAOYSA-N
Data: 1 IC50
Activity Spreadsheet -- Enzyme Inhibition Constant Data from BindingDB
Found 1 hit for monomerid = 50290376
Trg + Lig
Ki
nM
ΔG°
kcal/mole
IC50
nM
Kd
nM
EC50/IC50
nM
koff
s-1
kon
M-1s-1
pHTemp
°C
Progesterone receptor
(Oryctolagus cuniculus)
BDBM50290376
(1-(4-Fluoro-phenyl)-7-(4-methoxy-benzyl)-4,5,6,7-t...)
Show SMILES COc1ccc(CC2CCCc3c(C=O)nn(c23)-c2ccc(F)cc2)cc1
Show InChI InChI=1S/C22H21FN2O2/c1-27-19-11-5-15(6-12-19)13-16-3-2-4-20-21(14-26)24-25(22(16)20)18-9-7-17(23)8-10-18/h5-12,14,16H,2-4,13H2,1H3
n/an/a 163n/an/an/an/an/an/a
TBA
Curated by ChEMBL
Assay Description
Binding affinity determined by ability to displace [3H]-R5020 radioligand using uterine progesterone receptor obtained from estrogen-primed rabbit
Bioorg Med Chem Lett 7: 2551-2556 (1997)
Article DOI: 10.1016/S0960-894X(97)10016-6
BindingDB Entry DOI: 10.7270/Q2MW2H5C