BDBM50290628 2-((S)-1-Methyl-pyrrolidin-2-yl)-furo[3,2-b]pyridine::CHEMBL93883
SMILES: CN1CCC[C@H]1c1cc2ncccc2o1
InChI Key: InChIKey=BJFLPKJLIFUESE-JTQLQIEISA-N
Data: 2 EC50
Activity Spreadsheet -- Enzyme Inhibition Constant Data from BindingDB
Found 2 hits for monomerid = 50290628
Trg + Lig
Ki
nM
ΔG°
kcal/mole
IC50
nM
Kd
nM
EC50/IC50
nM
koff
s-1
kon
M-1s-1
pHTemp
°C
alpha-1 Nicotinic AChR
(Homo sapiens (Human))
BDBM50290628
(2-((S)-1-Methyl-pyrrolidin-2-yl)-furo[3,2-b]pyridi...)
Show SMILES CN1CCC[C@H]1c1cc2ncccc2o1
Show InChI InChI=1S/C12H14N2O/c1-14-7-3-4-10(14)12-8-9-11(15-12)5-2-6-13-9/h2,5-6,8,10H,3-4,7H2,1H3/t10-/m0/s1
n/an/an/an/a>1.00E+5n/an/an/an/a
TBA
Curated by ChEMBL
Assay Description
Tested for functional activity against alpha1 neuronal nicotinic acetylcholine receptor(nAChR) expressed in TE671 cells using isotopic rubidium efflu...
Bioorg Med Chem Lett 7: 2703-2708 (1997)
Article DOI: 10.1016/S0960-894X(97)10080-4
BindingDB Entry DOI: 10.7270/Q2Z60P30
Neuronal acetylcholine receptor Alpha-4/Beta-2
(Homo sapiens (Human))
BDBM50290628
(2-((S)-1-Methyl-pyrrolidin-2-yl)-furo[3,2-b]pyridi...)
Show SMILES CN1CCC[C@H]1c1cc2ncccc2o1
Show InChI InChI=1S/C12H14N2O/c1-14-7-3-4-10(14)12-8-9-11(15-12)5-2-6-13-9/h2,5-6,8,10H,3-4,7H2,1H3/t10-/m0/s1
NCI pathway
Reactome pathway
n/an/an/an/a 3.20E+3n/an/an/an/a
TBA
Curated by ChEMBL
Assay Description
Tested for functional activity against neuronal nicotinic acetylcholine receptor(nAChR) expressed in K177 cells using isotopic rubidium efflux assay.
Bioorg Med Chem Lett 7: 2703-2708 (1997)
Article DOI: 10.1016/S0960-894X(97)10080-4
BindingDB Entry DOI: 10.7270/Q2Z60P30